program: Gaussian 09
title: 000276214
version: EM64L-G09RevD.01
frameworkgroup: C1[X(C24H21NO3S)]
method: RPBEPBE
basis: SDD
operation: Freq
keyword: #p
keyword: freq=noraman
keyword: PBEPBE/SDD
title: #p freq=noraman PBEPBE/SDD
converged: YES YES NO NO
title: Mulliken charges:
elementType: S O O O N C C C C C C C C C C C C C C C C C C C C C C C C H H H H H H H H H H H H H H H H H H H H H
charge: 0.173577 -0.448652 -0.197225 -0.260529 -0.403267 -0.646980 0.285864 0.369116 0.170313 0.171481 0.506888 -0.408316 -0.384024 -0.708297 -0.398293 -0.377975 -0.397465 -0.355754 -0.071527 -0.250018 -0.256264 -0.235296 -0.238749 -0.239931 -0.253103 -0.241419 0.179574 0.250183 -0.774094 0.269815 0.252730 0.314959 0.264439 0.246242 0.240370 0.253634 0.249553 0.322689 0.227221 0.227680 0.225168 0.225126 0.225525 0.225597 0.227855 0.330350 0.388468 0.253500 0.255492 0.213771
chargesum: 0.00000
title: Mulliken charges with hydrogens summed into heavy atoms:
elementType: S O O O N C C C C C C C C C C C C C C C C C C C C C C C C
charge: 0.173577 -0.060183 -0.197225 -0.260529 -0.072917 -0.646980 0.285864 0.369116 0.170313 0.171481 0.506888 -0.138501 -0.131294 -0.128900 -0.152051 -0.137606 -0.143831 -0.106201 0.251163 -0.022797 -0.028584 -0.010128 -0.013623 -0.014406 -0.027507 -0.013564 0.179574 0.250183 -0.051331
polarizability: 3.07038038e+02 2.39259425e+01 3.10638162e+02 2.09019944e+01 -1.66817667e+01 2.50356846e+02
1716.lowfreq: -5.8617 -0.0012 -0.0003 0.0005 7.6975 7.9527 13.4723 27.6642 35.3629
frequency: 13.2178 27.4332 35.2312 40.3699 45.3971 53.7978 56.6002 59.2262 67.6707 82.6256 88.5111 95.6661 112.0026 143.8226 155.1916 173.3249 193.1875 220.1742 226.0950 258.7134 269.0443 286.8585 297.4511 311.1611 333.9531 345.7401 385.1339 404.9883 413.3696 421.9625 470.8340 484.4015 496.0354 498.9384 511.2845 556.7774 566.4607 573.3264 590.3744 612.8861 615.0319 617.9495 624.1201 627.0657 629.6876 666.4434 694.2887 707.6439 714.2602 719.5385 744.3464 753.8126 754.3520 767.3577 768.4350 792.2955 826.5357 861.0747 876.9211 880.0562 885.0211 888.2685 921.5997 933.5310 938.9142 951.1401 954.7731 979.5805 985.5157 986.1350 988.6078 990.0894 996.0862 998.7678 1010.5381 1022.5233 1030.5723 1032.6805 1041.3714 1075.1524 1085.7253 1093.4418 1095.9031 1108.4043 1154.5374 1166.1922 1172.4954 1173.3857 1174.2782 1186.3821 1196.1864 1232.8444 1239.3078 1245.9881 1250.2204 1286.8904 1290.0066 1303.8318 1305.0918 1321.2154 1330.2016 1371.1119 1376.3716 1387.2145 1404.6889 1425.3971 1431.3267 1439.0123 1442.4981 1450.4592 1463.8330 1465.0047 1476.2272 1479.4741 1485.2448 1585.0880 1591.2682 1592.1929 1609.1952 1613.0908 1614.7979 1618.0252 1688.3188 2997.7588 3028.0538 3090.9804 3099.2366 3101.7116 3109.2752 3122.9028 3125.7217 3129.5329 3131.1514 3137.2910 3143.1863 3144.2462 3148.6059 3153.5781 3156.1212 3162.9736 3165.5152 3168.2130 3526.5270 3548.1811
redmass: 6.3316 8.0530 6.6526 5.3123 4.5639 7.0086 4.2487 5.2986 1.6957 4.6001 2.1576 3.6406 5.3183 4.3130 5.3474 7.1592 4.9633 3.4190 4.9023 4.9686 5.0313 4.8967 4.5908 4.2916 7.2143 4.3602 5.1346 2.9755 5.6671 3.2044 3.3105 4.7730 4.1452 3.7417 5.0191 3.2679 3.3319 1.9117 1.7619 6.7291 6.2740 2.4697 5.7265 1.6498 3.7576 5.7297 4.4630 1.8776 5.4136 5.1489 3.0548 1.3880 2.0467 1.8151 2.9755 2.3145 3.3490 1.2629 2.8809 1.8825 1.5358 2.6057 5.0619 4.1508 1.5748 1.4490 1.4433 1.6467 1.3722 1.4051 1.3473 5.0698 5.3585 1.3496 3.7899 2.2604 2.2534 2.0069 1.6468 2.0388 1.7650 2.1237 3.8215 1.8269 2.1126 1.2511 1.1972 1.0513 1.1668 1.8089 1.1204 2.5509 1.3465 2.1527 1.7601 1.4925 2.1039 1.5929 1.8984 1.3689 1.2064 7.0746 8.5106 1.2286 3.5235 1.0969 2.2258 2.2456 2.7751 1.0457 2.2771 1.3106 1.6107 2.2566 3.8162 6.1180 6.8317 6.7339 6.0704 6.7350 7.3105 6.9814 9.1356 1.0358 1.0574 1.0899 1.0981 1.1008 1.1025 1.0846 1.0850 1.0853 1.0880 1.0895 1.0913 1.0915 1.0951 1.0954 1.0950 1.1003 1.1009 1.0998 1.0643 1.0781
irintensity: 0.7512 3.8942 3.4825 0.8431 0.2765 1.3054 0.8370 0.4040 2.4150 0.9789 0.4220 0.2674 1.3091 0.5852 4.1330 0.5932 0.5270 1.4394 0.2650 2.7081 0.0508 2.3080 0.3060 0.0886 2.1642 3.4038 4.5839 0.0702 1.0170 9.4924 1.5693 0.7304 19.6671 5.8075 1.3858 27.4999 0.0910 15.0165 141.7831 1.4495 1.9786 12.4001 14.6866 47.4623 42.3816 24.2721 5.4579 42.6390 30.0839 3.7508 51.5402 102.1668 52.6962 24.2260 1.3436 0.1768 4.8877 0.4255 1.1382 13.7557 4.2040 49.4908 2.2793 81.3119 2.9278 0.0330 0.1380 2.9690 0.2658 0.4410 0.0938 0.7018 2.0765 0.2517 4.7485 1.4465 11.1926 6.4141 12.5493 154.9070 4.6502 6.4504 12.0428 1.5259 2.5110 0.3273 20.7603 0.0457 6.8630 0.0534 4.5407 4.7420 13.9457 14.4512 23.7038 4.0358 40.1857 41.4036 0.3253 1.4995 21.1468 2.0796 1.1571 67.6045 0.5807 6.2811 5.7796 36.2359 13.0898 15.3557 20.0542 99.4071 145.9707 17.4939 4.8375 0.9221 1.1219 0.3777 9.5386 120.4114 8.4672 1.5874 171.7288 12.9706 9.6217 3.3430 7.7321 17.9499 1.1525 1.4863 0.5286 1.1404 5.1763 10.8171 21.0804 12.0768 17.3881 16.1680 25.6986 37.8371 26.3304 20.7029 35.0095 36.9301
temp: 298.150 k
press: 1.00000 atm
elementType: 16 8 8 8 7 6 6 6 6 6 6 6 6 6 6 6 6 6 6 6 6 6 6 6 6 6 6 6 6 1 1 1 1 1 1 1 1 1 1 1 1 1 1 1 1 1 1 1 1 1
symmnumber: 1
zpe: 1017091.7 jmol-1
zpe.correction: 0.387390 hartree
zpe.thermalcorrener: 0.413881 hartree
zpe.thermalcorrenthalpy: 0.414825 hartree
zpe.thermalcorrgfe: 0.327659 hartree
zpe.sumelectzpe: -1603.641010 hartree
zpe.sumelectthermal: -1603.614519 hartree
zpe.sumelectthermalent: -1603.613575 hartree
zpe.sumelectthermalfe: -1603.700741 hartree
dipole: 2.7783 -0.4850 -2.2774
dipole: 3.6250
quadrupole: -149.7266 -161.3177 -172.3715
quadrupole: -5.2743 -7.5814 1.3436
quadrupole: 11.4120 -0.1791 -11.2329 -5.2743 -7.5814 1.3436
hfenergy: -1604.0283999 hartree
pointgroup: C01 [X(C24H21N1O3S1)]
dipole: -1.2034301 0.4531756 0.616797 debye
polarizability: 296.9433379|1.0560008|299.1275157|37.2614076|-28.5229712|271.9621928 unknown
InChI: InChI=1S/C24H21NO3S/c1-16(26)25-22(23(27)28)15-29-24(17-9-3-2-4-10-17)20-13-7-5-11-18(20)19-12-6-8-14-21(19)24/h2-14,22,25,27H,15H2,1H3
charge 0 multiplicity 1
50 atoms
S  0.115411 0.277778 2.19267
O  -3.457735 -1.099187 3.060843
O  -1.994836 -2.638383 2.110833
O  -3.238111 0.346637 -1.645174
N  -3.77709 0.015281 0.593661
C  1.27392 0.204322 0.602684
C  1.143233 1.528084 -0.1482
C  0.740866 -0.80882 -0.421322
C  0.553756 1.315066 -1.428616
C  0.316522 -0.131596 -1.602653
C  2.671384 -0.144599 1.133808
C  1.480519 2.82313 0.282188
C  0.644273 -2.206848 -0.322081
C  -1.560009 0.726612 1.454667
C  0.300679 2.404545 -2.28986
C  -0.22591 -0.851161 -2.686574
C  3.823805 0.457863 0.565347
C  2.849766 -1.135903 2.135466
C  -2.435718 -0.469441 0.969883
C  1.235207 3.916226 -0.585364
C  0.111033 -2.931324 -1.416711
C  0.648757 3.706682 -1.860044
C  -0.322313 -2.258248 -2.586857
C  5.117939 0.083342 0.989903
C  4.143087 -1.504022 2.56478
C  5.284939 -0.897615 1.993172
C  -2.567251 -1.536428 2.054041
C  -4.086745 0.398547 -0.70474
C  -5.51911 0.880566 -0.918412
H  1.914019 2.982082 1.275301
H  0.952468 -2.730433 0.587694
H  -1.400627 1.417494 0.610482
H  -2.079586 1.263286 2.266687
H  -0.164781 2.248793 -3.26891
H  -0.584597 -0.333498 -3.58185
H  3.708725 1.216687 -0.215036
H  1.972902 -1.609175 2.591193
H  -1.972799 -0.930719 0.083988
H  1.494368 4.932454 -0.267952
H  0.021347 -4.021176 -1.351779
H  0.458966 4.564669 -2.514959
H  -0.74737 -2.834035 -3.416476
H  5.994769 0.559306 0.536329
H  4.258025 -2.265025 3.344968
H  6.28907 -1.18442 2.325145
H  -4.467053 0.103152 1.342763
H  -3.516773 -1.788154 3.775922
H  -5.498246 1.913693 -1.306071
H  -5.995887 0.251606 -1.689761
H  -6.136308 0.853209 -0.004017
