program: Gaussian 09
title: 000270513
version: EM64L-G09RevD.01
frameworkgroup: C1[X(C18H17NO4)]
method: RPBEPBE
basis: SDD
operation: Freq
keyword: #p
keyword: freq=noraman
keyword: PBEPBE/SDD
title: #p freq=noraman PBEPBE/SDD
converged: YES YES NO NO
title: Mulliken charges:
elementType: O O O O N C C C C C C C C C C C C C C C C C C H H H H H H H H H H H H H H H H H
charge: -0.370947 -0.258142 -0.412119 -0.244685 -0.194637 0.395426 -0.530191 0.545774 0.202523 -0.475650 -0.357088 -0.440110 -0.399697 -0.403254 -0.339332 -0.319606 0.495906 0.188637 -0.392880 -0.406509 -0.236670 -0.238256 -0.245500 0.276427 0.266290 0.290003 0.263194 0.302781 0.271524 0.226195 0.229597 0.218282 0.214578 0.221556 0.226612 0.371134 0.224757 0.226733 0.229585 0.377760
chargesum: 0.00000
title: Mulliken charges with hydrogens summed into heavy atoms:
elementType: O O O O N C C C C C C C C C C C C C C C C C C
charge: 0.000187 -0.258142 -0.034359 -0.244685 -0.194637 0.395426 0.012526 0.545774 0.202523 0.077546 -0.054306 -0.168586 -0.173503 -0.173657 -0.121050 -0.105028 0.495906 0.188637 -0.171324 -0.179897 -0.011913 -0.011523 -0.015915
polarizability: 5.19056057e+02 -2.48060030e+01 2.09305314e+02 -8.91361416e-01 -2.38713848e+00 1.02966881e+02
1716.lowfreq: -2.9651 -0.0008 0.0006 0.0009 2.1204 7.9202 15.7248 20.0861 28.0654
frequency: 15.7023 20.0425 28.0479 35.8870 42.1644 49.0914 59.7190 79.6242 92.7981 114.6388 140.2867 156.4625 192.4251 216.2868 229.7941 261.2436 263.8278 287.8745 301.8714 355.5297 379.5355 395.9989 403.1658 413.3640 451.6454 471.1736 489.3706 508.1225 533.4056 543.7428 555.8764 575.8791 603.2317 615.6464 629.6568 643.7778 651.4149 694.7718 722.7359 729.0801 768.9234 799.5639 817.4552 834.1540 841.7461 848.3607 862.8921 882.2132 889.5752 910.0777 923.7180 963.3702 976.2162 980.5572 986.3652 987.1250 997.2638 1000.1527 1012.5993 1014.5442 1026.1317 1053.5431 1083.7928 1096.8182 1129.7658 1154.0043 1165.8790 1172.3837 1191.3414 1197.6689 1204.7601 1237.3371 1245.4726 1256.8325 1284.4338 1293.3447 1304.7868 1320.3177 1325.0923 1340.1186 1348.7307 1378.1430 1381.4917 1389.5314 1426.7167 1441.1359 1442.0195 1449.8358 1482.7347 1499.4642 1562.6594 1581.4889 1587.8378 1604.2097 1618.1800 1645.5356 1661.3283 2994.4300 3003.2358 3063.8159 3082.8549 3089.6703 3100.1235 3117.0175 3124.4524 3125.7469 3137.9595 3143.7033 3147.9389 3164.7539 3182.2486 3204.6758 3441.7413 3514.3361
redmass: 7.1802 4.2544 6.0872 6.3599 5.8191 5.5399 4.7368 4.5249 4.3923 3.0355 4.2754 3.3201 5.6938 5.2998 3.3151 3.9879 4.5481 1.3483 4.3687 6.2016 4.3570 8.0664 2.8131 3.0054 3.8211 4.1893 2.8335 2.1520 2.9530 2.9412 5.0176 5.6689 4.5184 6.4481 6.2423 4.6122 1.6085 1.7420 6.1695 2.9908 1.8749 1.7373 5.2465 1.3902 1.3223 1.3776 4.1036 5.4427 1.7871 4.0183 1.6211 1.3183 1.3914 1.2803 1.3151 5.3343 1.2803 4.0298 2.7370 2.9320 2.1962 2.9417 1.6271 2.4565 1.4231 1.5240 1.6864 1.0629 1.1166 1.3542 2.1001 1.3196 1.3874 1.3336 2.2742 3.0139 1.4487 1.2879 1.5325 1.2865 1.9384 3.8308 2.3943 5.2310 3.6179 1.9719 1.1795 1.1018 2.2744 2.6434 6.8309 5.6169 8.4581 5.7870 6.1304 5.3679 8.0596 1.0662 1.0655 1.0924 1.0955 1.0916 1.0859 1.0869 1.0858 1.0899 1.0911 1.0899 1.0960 1.1015 1.0933 1.0943 1.0683 1.0639
irintensity: 0.0884 0.1314 0.9848 1.3679 0.3814 4.5368 0.3075 1.9788 1.5756 0.8495 2.3685 10.8242 7.1887 5.5684 8.7824 2.2162 0.3817 134.4444 11.3840 26.7852 7.0986 6.9305 0.0927 0.1531 36.1285 2.7553 3.0444 47.6527 19.9212 20.9045 69.3546 7.8688 10.7881 0.0496 3.0541 19.8735 105.3219 49.0649 4.0886 12.4428 28.6479 17.6136 2.2112 30.2912 12.2625 31.1723 0.4355 2.9181 9.2806 7.9997 0.0165 21.0585 0.0247 25.7079 8.8714 0.5876 12.7741 7.8693 12.5663 53.1701 6.8092 249.1233 10.3882 88.5627 6.2569 17.2188 39.0543 0.0441 3.5665 41.1316 2.1632 29.7227 32.1945 61.7941 160.8915 44.2338 4.8755 47.0036 120.4310 2.8811 462.4661 12.6334 1.2119 0.2936 4.3178 9.3203 4.5001 67.6500 1.8005 188.5560 3.4602 5.4235 196.2274 21.3999 0.2049 2.0247 199.9750 6.4198 43.6810 1.1113 7.0209 0.2994 44.7743 13.6959 2.6906 18.2382 6.6232 7.6624 45.0798 41.7789 3.4099 2.8828 12.2598 28.0177
temp: 298.150 k
press: 1.00000 atm
elementType: 8 8 8 8 7 6 6 6 6 6 6 6 6 6 6 6 6 6 6 6 6 6 6 1 1 1 1 1 1 1 1 1 1 1 1 1 1 1 1 1
symmnumber: 1
zpe: 810322.6 jmol-1
zpe.correction: 0.308636 hartree
zpe.thermalcorrener: 0.330329 hartree
zpe.thermalcorrenthalpy: 0.331273 hartree
zpe.thermalcorrgfe: 0.253553 hartree
zpe.sumelectzpe: -1050.083128 hartree
zpe.sumelectthermal: -1050.061435 hartree
zpe.sumelectthermalent: -1050.060490 hartree
zpe.sumelectthermalfe: -1050.138210 hartree
dipole: 0.4369 1.8753 0.7262
dipole: 2.0579
quadrupole: -115.1423 -123.4567 -141.2994
quadrupole: -0.8027 1.5661 -1.3249
quadrupole: 11.4905 3.1761 -14.6666 -0.8027 1.5661 -1.3249
hfenergy: -1050.3917633 hartree
pointgroup: C01 [X(C18H17N1O4)]
dipole: -0.1671287 0.7472231 -0.2631141 debye
polarizability: 519.4536747|22.0605934|208.6571277|-3.2312449|5.2803545|103.21745 unknown
InChI: InChI=1S/C18H17NO4/c20-17(12-13-18(21)22)19(23)16-10-8-15(9-11-16)7-6-14-4-2-1-3-5-14/h1-11,21,23H,12-13H2
charge 0 multiplicity 1
40 atoms
O  3.29587 2.121828 -0.074529
O  3.346026 -1.472555 0.068978
O  8.413741 -1.635363 0.405119
O  7.829028 0.006758 -1.125249
N  2.752687 0.772493 -0.107151
C  1.320506 0.694673 -0.046354
C  5.166358 0.186051 0.008789
C  -1.5457 0.613298 0.020115
C  3.703464 -0.258543 0.006125
C  6.095872 -0.994776 0.33496
C  0.631859 -0.539417 -0.232766
C  0.574187 1.88123 0.178291
C  -0.771512 -0.564539 -0.196251
C  -0.830464 1.830225 0.207678
C  -3.013845 0.633472 0.062492
C  -3.855181 -0.43753 -0.097888
C  -5.325784 -0.41957 -0.054006
C  7.489447 -0.785104 -0.216325
C  -6.09391 0.761045 0.176537
C  -6.030723 -1.643265 -0.250562
C  -7.500944 0.713821 0.207758
C  -7.439813 -1.6913 -0.219579
C  -8.184441 -0.511532 0.010047
H  5.3064 1.021445 0.715355
H  5.43254 0.592626 -0.987394
H  5.683179 -1.924491 -0.10512
H  6.15872 -1.18796 1.419136
H  1.201958 -1.456131 -0.385108
H  1.095859 2.82484 0.352824
H  -1.270763 -1.528576 -0.341005
H  -1.390487 2.756142 0.387702
H  -3.45361 1.624741 0.243598
H  -3.415018 -1.428606 -0.27967
H  -5.589446 1.720909 0.333425
H  -5.459553 -2.563222 -0.42877
H  3.28467 2.433558 -1.024097
H  -8.071083 1.632597 0.386855
H  -7.956567 -2.645187 -0.373643
H  -9.279197 -0.54363 0.035352
H  9.30987 -1.502154 -0.008662
