program: Gaussian 09
title: 000276102
version: EM64L-G09RevD.01
frameworkgroup: C1[X(C16H19N3)]
method: RPBEPBE
basis: SDD
operation: Freq
keyword: #pfreq=noraman
keyword: PBEPBE/SDD
title: #p freq=noraman PBEPBE/SDD
converged: YES YES NO NO
title: Mulliken charges:
elementType: N N N C C C C C C C C C C C C C C C C H H H H H H H H H H H H H H H H H H H
charge: -0.462555 -0.427102 -0.424506 -0.033820 -0.409027 -0.461057 0.308393 0.319544 -0.414934 -0.414997 0.460217 -0.240878 -0.242295 -0.381338 -0.444650 0.439768 -0.402320 -0.361959 -0.811364 0.226139 0.204292 0.207976 0.218208 0.225453 0.311021 0.287494 0.282730 0.215669 0.207180 0.217167 0.216842 0.248491 0.212031 0.225577 0.225176 0.220419 0.222296 0.230721
chargesum: 0.00000
title: Mulliken charges with hydrogens summed into heavy atoms:
elementType: N N N C C C C C C C C C C C C C C C C
charge: -0.151535 -0.139608 -0.141777 0.192319 0.003240 -0.017397 0.308393 0.319544 -0.199265 -0.207818 0.460217 -0.023711 -0.025453 -0.132847 -0.232619 0.439768 -0.176743 -0.136783 -0.137927
polarizability: 2.57957295e+02 1.20341710e+01 2.07564388e+02 -1.15112792e+01 4.06354345e+00 1.27881719e+02
1716.lowfreq: -13.3202 -7.7027 -5.7607 -0.0003 0.0003 0.0004 17.5618 28.0263 31.3302
frequency: 17.3892 27.9738 31.2333 38.1908 69.8683 104.6089 138.7570 141.7197 206.8095 224.1999 258.6790 279.4135 316.8263 339.3780 353.2537 373.8454 407.3453 416.2370 418.9337 443.1832 464.5572 485.9653 494.4236 508.2338 534.1009 554.1569 560.7416 588.1329 639.8512 660.4104 709.8029 722.6137 723.8581 731.4643 739.6564 809.2382 811.1573 820.0934 826.9205 857.4746 896.7946 900.1235 928.8857 935.6543 940.5320 953.9932 984.8899 1000.0427 1031.2152 1039.6029 1045.6039 1077.7805 1081.0149 1092.1203 1125.4027 1130.2518 1160.9572 1165.6485 1193.5014 1216.5594 1225.9116 1240.1630 1259.1317 1271.3749 1283.5673 1288.2177 1294.7355 1315.7667 1335.4642 1347.3412 1362.1355 1373.4234 1397.9572 1398.1545 1402.9189 1417.9769 1458.4907 1467.3248 1468.2556 1472.9988 1473.5117 1490.0079 1493.1717 1518.6096 1524.4580 1585.9904 1605.2479 1619.5166 1635.4557 2891.9853 2916.9127 2967.2040 2972.3600 3028.5780 3046.4093 3049.3654 3076.7297 3101.7916 3107.3718 3113.5272 3117.5546 3129.1366 3137.3609 3152.3706 3161.7449 3533.7351 3561.5256 3569.9439
redmass: 4.4015 4.3595 1.0362 3.5630 4.6279 4.3723 3.7838 3.1370 4.4084 4.0625 2.8341 3.6860 3.5374 2.7423 1.6441 2.1369 2.4987 1.3380 2.7899 2.9647 1.5511 4.3972 3.8571 2.8336 2.0740 3.1286 3.8920 4.7926 6.6477 3.8115 2.9715 3.9852 3.8741 1.2484 4.6104 1.8837 3.2323 1.2941 1.4558 3.1912 1.4558 2.7493 1.2998 2.0071 1.2853 1.3533 1.4277 2.8761 2.3534 3.0648 1.5154 2.4463 2.7556 3.0912 1.5150 1.3955 2.6701 1.0530 1.1047 1.2416 2.6152 1.2886 1.7846 1.5350 1.9276 1.5247 1.5507 1.4488 1.8042 1.4435 1.4763 2.6494 2.3378 1.5820 1.6378 3.4310 1.1639 1.4374 1.2318 1.0554 1.2446 1.4265 1.9241 3.4129 3.1478 4.5969 5.9150 6.1709 6.4879 1.0801 1.0714 1.0390 1.0633 1.0922 1.0947 1.0995 1.0994 1.0868 1.0873 1.0885 1.0887 1.0961 1.0913 1.0943 1.1002 1.0764 1.0764 1.0770
irintensity: 0.3938 0.1338 0.5516 0.3720 2.2925 2.1952 2.6921 2.1026 3.0094 0.9919 0.9272 6.9445 1.2847 6.4339 66.1013 34.9384 4.4619 30.4600 19.3457 11.6384 155.3358 7.7031 17.3125 16.7430 86.1041 15.3783 10.8957 5.8806 0.5023 4.3121 0.7938 1.2000 9.8145 117.3798 1.6613 61.4554 16.1095 3.9655 0.2108 11.1476 5.9946 0.8699 2.3924 6.0634 0.0682 0.0413 2.0863 0.1962 9.9411 1.0139 20.4744 10.0351 26.8508 18.6549 17.4758 21.0850 15.5540 0.5096 9.7041 27.8942 2.6335 10.5771 2.6339 10.8229 87.5675 8.7820 10.5941 29.0750 248.0063 4.5021 54.2577 11.1841 30.7692 14.9020 0.1822 4.4369 26.1776 11.9615 20.7955 11.6427 13.5594 4.3151 57.2566 258.0478 251.1482 5.5463 36.5883 58.5852 96.0202 71.2218 107.6021 66.8518 63.8028 44.4871 26.3592 30.7486 20.7857 18.9099 24.3160 9.5070 22.3893 31.9798 26.6291 10.9708 30.3888 49.0711 20.6783 14.3343
temp: 298.150 k
press: 1.00000 atm
elementType: 7 7 7 6 6 6 6 6 6 6 6 6 6 6 6 6 6 6 6 1 1 1 1 1 1 1 1 1 1 1 1 1 1 1 1 1 1 1
symmnumber: 1
zpe: 833881.9 jmol-1
zpe.correction: 0.317609 hartree
zpe.thermalcorrener: 0.335120 hartree
zpe.thermalcorrenthalpy: 0.336064 hartree
zpe.thermalcorrgfe: 0.269859 hartree
zpe.sumelectzpe: -783.983033 hartree
zpe.sumelectthermal: -783.965522 hartree
zpe.sumelectthermalent: -783.964577 hartree
zpe.sumelectthermalfe: -784.030782 hartree
dipole: 0.7948 -3.6820 0.0453
dipole: 3.7671
quadrupole: -110.6346 -101.9357 -112.9783
quadrupole: 10.3612 -7.5740 1.6178
quadrupole: -2.1184 6.5805 -4.4621 10.3612 -7.5740 1.6178
hfenergy: -784.3006417 hartree
pointgroup: C01 [X(C16H19N3)]
dipole: -0.3544767 1.0961203 -0.9324553 debye
polarizability: 255.3519798|22.9207282|172.6436337|5.9403941|-39.2101472|165.4077883 unknown
InChI: InChI=1S/C16H19N3/c1-12-6-8-13(9-7-12)17-10-14-11-18-15-4-2-3-5-16(15)19-14/h2-9,14,17-19H,10-11H2,1H3
charge 0 multiplicity 1
38 atoms
N  0.933497 0.158915 -0.250256
N  3.281156 1.648737 -0.517551
N  -1.494326 0.940897 -1.740387
C  0.955804 1.262419 -1.216142
C  1.991509 2.309137 -0.733664
C  -0.455476 1.890877 -1.332362
C  2.135374 -0.36421 0.272133
C  3.339181 0.407811 0.151109
C  2.182553 -1.61693 0.928966
C  4.547048 -0.103431 0.681492
C  -2.478604 0.382765 -0.901407
C  3.3951 -2.115691 1.459169
C  4.582472 -1.360316 1.329297
C  -2.410214 0.445662 0.520545
C  -3.587779 -0.295169 -1.487852
C  -4.53576 -0.806556 0.733884
C  -3.427587 -0.135788 1.307899
C  -4.584589 -0.878806 -0.683298
C  -5.635832 -1.404152 1.595075
H  1.275534 0.914794 -2.226933
H  2.111926 3.093485 -1.504756
H  1.598279 2.790391 0.191112
H  -0.40377 2.716911 -2.07081
H  -0.734129 2.338425 -0.360919
H  0.127252 -0.467688 -0.299684
H  4.123478 2.222542 -0.523001
H  -1.63175 0.812919 -2.742709
H  1.25936 -2.20328 1.022941
H  5.465745 0.490251 0.585055
H  3.407508 -3.087218 1.964788
H  5.528749 -1.738632 1.730717
H  -1.557817 0.921072 1.015983
H  -3.662577 -0.361616 -2.581413
H  -3.345889 -0.073793 2.400551
H  -5.422469 -1.396406 -1.167428
H  -6.075715 -2.302855 1.126115
H  -5.2564 -1.694825 2.591018
H  -6.461441 -0.683047 1.757323
