program: Gaussian 09
title: 000270507
version: EM64L-G09RevD.01
frameworkgroup: C1[X(C16H14ClNO2)]
method: RPBEPBE
basis: SDD
operation: Freq
keyword: #p
keyword: freq=noraman
keyword: PBEPBE/SDD
title: #p freq=noraman PBEPBE/SDD
converged: YES YES NO NO
title: Mulliken charges:
elementType: Cl O O N C C C C C C C C C C C C C C C C H H H H H H H H H H H H H H
charge: -0.018012 -0.376075 -0.214502 -0.197973 0.543165 0.414151 -0.397223 -0.402552 -0.354902 -0.437794 -0.337257 0.495388 -0.317412 -0.391716 -0.405181 0.266800 -0.236353 -0.237791 -0.244352 -0.684261 0.228522 0.230942 0.297303 0.268001 0.218531 0.215020 0.221446 0.227235 0.225422 0.227684 0.230373 0.300859 0.271474 0.371042
chargesum: 0.00000
title: Mulliken charges with hydrogens summed into heavy atoms:
elementType: Cl O O N C C C C C C C C C C C C C C C C
charge: -0.018012 -0.005033 -0.214502 -0.197973 0.543165 0.414151 -0.168701 -0.171610 -0.057599 -0.169793 -0.118726 0.495388 -0.102393 -0.170271 -0.177946 0.266800 -0.010931 -0.010107 -0.013978 -0.111929
polarizability: 4.82960627e+02 -1.51013011e+01 1.97234848e+02 -2.04396374e+00 -5.04454870e+00 8.36940383e+01
1716.lowfreq: -4.2771 -1.6643 -0.0017 -0.0016 -0.0012 6.7642 19.3708 24.1901 39.1632
frequency: 19.3445 24.1314 39.1436 47.1782 48.2046 78.2364 99.2283 105.0145 155.1991 166.4734 202.1335 226.0464 260.2875 269.5706 272.2622 341.1745 354.5183 380.4311 392.4795 403.0288 413.5847 471.5947 487.7527 526.8793 530.3679 541.9458 577.1876 615.1735 619.4871 637.9278 694.5656 704.8888 727.7004 744.2265 768.9846 817.2307 833.3235 838.5840 846.9041 864.1737 889.5627 901.8023 910.2520 924.0414 960.9092 976.2393 976.7578 983.9991 987.3151 995.9751 997.7396 1009.6241 1026.0977 1083.9297 1129.1453 1142.3978 1154.0604 1172.7343 1191.8306 1196.8930 1205.3107 1244.6738 1262.5129 1289.9641 1295.0183 1304.8669 1322.2016 1340.7590 1354.4040 1381.1624 1390.3627 1415.1665 1427.1856 1441.3127 1482.7791 1499.6382 1564.0424 1581.6821 1603.7850 1614.8202 1617.5826 1645.3653 3060.4596 3090.9883 3101.4351 3117.5066 3125.4230 3126.8839 3135.0747 3138.7447 3147.1290 3148.9172 3165.3304 3174.5985 3203.3917 3435.0417
redmass: 4.5230 6.0393 8.5974 4.7034 6.1976 3.8721 4.0387 4.3414 4.3406 6.4847 6.7159 3.3929 3.9255 6.6752 10.4418 1.4788 2.6254 3.8736 8.8006 2.8095 2.9093 4.2237 2.8334 4.2911 4.6409 2.8503 6.8733 6.4710 6.8887 7.0729 1.7482 6.9799 3.0050 7.4442 1.8633 5.2581 1.3297 1.4421 1.3289 4.0582 1.7862 3.7192 2.2345 1.6033 1.3345 1.3597 1.3699 1.2219 6.1176 5.3400 1.3061 3.2112 2.2013 1.6285 1.5074 1.5672 1.4424 1.0629 1.1184 1.3070 2.1124 1.4147 1.6295 1.8030 2.4040 1.4078 1.4865 1.2840 1.8418 4.8294 4.9596 1.0948 3.5517 2.3127 2.2683 2.6274 6.8550 5.5956 5.7480 9.8334 6.2239 5.3479 1.0573 1.0916 1.0858 1.0870 1.0858 1.0897 1.1074 1.0910 1.0898 1.0959 1.1015 1.0938 1.0946 1.0681
irintensity: 0.6051 1.5915 0.0354 3.5874 0.6986 1.5412 4.1127 3.7669 3.7621 0.7265 1.1407 5.8881 1.3425 2.4358 3.3669 68.2170 103.0257 12.2117 14.3204 0.1568 1.7842 1.4054 1.2200 12.3198 7.6956 21.4746 1.1480 2.1283 26.4563 9.9562 48.3811 30.3950 13.1901 35.2008 29.2886 1.8229 16.4282 38.4631 19.8146 0.2399 8.3754 3.5761 4.9866 0.0381 17.1487 5.6277 2.3349 30.0214 0.0563 21.1720 13.5522 9.5448 5.6840 9.2028 16.7798 75.5225 49.4718 0.1063 5.6038 36.2802 3.4538 32.9195 88.5766 84.7428 101.7085 4.0285 33.6103 1.8977 205.2928 20.1901 0.7315 23.1238 1.5649 7.8239 1.6423 173.5909 1.3283 2.2608 15.2788 153.7053 5.7510 4.6340 7.4190 0.0778 43.3347 13.3551 2.4711 17.2785 3.9114 7.1252 6.3680 44.7104 40.3522 3.9897 1.0034 10.0983
temp: 298.150 k
press: 1.00000 atm
elementType: 17 8 8 7 6 6 6 6 6 6 6 6 6 6 6 6 6 6 6 6 1 1 1 1 1 1 1 1 1 1 1 1 1 1
symmnumber: 1
zpe: 677166.5 jmol-1
zpe.correction: 0.257919 hartree
zpe.thermalcorrener: 0.276426 hartree
zpe.thermalcorrenthalpy: 0.277370 hartree
zpe.thermalcorrgfe: 0.207853 hartree
zpe.sumelectzpe: -1281.891112 hartree
zpe.sumelectthermal: -1281.872605 hartree
zpe.sumelectthermalent: -1281.871660 hartree
zpe.sumelectthermalfe: -1281.941178 hartree
dipole: 2.4086 4.3044 2.0996
dipole: 5.3608
quadrupole: -124.0869 -114.0245 -127.4004
quadrupole: -20.4612 -9.0561 0.2171
quadrupole: -2.2497 7.8128 -5.5631 -20.4612 -9.0561 0.2171
hfenergy: -1282.1490308 hartree
pointgroup: C01 [X(C16H14Cl1N1O2)]
dipole: -0.8844479 1.7090156 -0.8632762 debye
polarizability: 483.6771984|4.9881207|196.6855064|-0.5250858|2.8923107|83.5268084 unknown
InChI: InChI=1S/C16H14ClNO2/c17-12-16(19)18(20)15-10-8-14(9-11-15)7-6-13-4-2-1-3-5-13/h1-11,20H,12H2
charge 0 multiplicity 1
34 atoms
Cl 7.484393 -1.628708 0.216341
O  4.610336 1.764454 -0.284655
O  4.475682 -1.770793 0.314599
N  3.980636 0.451818 -0.17819
C  -0.313096 0.531717 -0.010219
C  2.549092 0.457156 -0.092538
C  0.395271 -0.694497 -0.182982
C  0.466037 1.715795 0.126982
C  1.797344 -0.745294 -0.228485
C  1.87149 1.690293 0.091595
C  -1.77774 0.632615 0.03532
C  -4.143184 -0.298235 -0.020472
C  -2.675945 -0.398878 -0.064158
C  -4.844313 0.935275 0.132655
C  -4.914505 -1.491719 -0.137324
C  4.876793 -0.602392 0.080787
C  -6.25159 0.967647 0.166562
C  -6.324022 -1.460089 -0.103297
C  -7.001769 -0.228655 0.04882
C  6.350254 -0.165324 0.044159
H  -0.155981 -1.634788 -0.288084
H  -0.043527 2.675746 0.275245
H  2.316194 -1.697229 -0.346802
H  2.443806 2.610427 0.234479
H  -2.162433 1.654288 0.164678
H  -2.291313 -1.421387 -0.18901
H  -4.287784 1.874321 0.226055
H  -4.395201 -2.451249 -0.255497
H  -6.770065 1.925921 0.285257
H  -6.892861 -2.392048 -0.194909
H  -8.096519 -0.198761 0.07579
H  6.576782 0.520012 0.874272
H  6.60531 0.327376 -0.905138
H  4.427328 2.064885 -1.220636
