program: Gaussian 09
title: 000270503
version: EM64L-G09RevD.01
frameworkgroup: C1[X(C8H9IN2O3)]
method: RPBEPBE
basis: SDD
operation: Freq
keyword: #p
keyword: freq=noraman
keyword: PBEPBE/SDD
title: #p freq=noraman PBEPBE/SDD
converged: YES YES NO NO
title: Mulliken charges:
elementType: I O O O N N C C C C C C C C H H H H H H H H H
charge: 0.165131 -0.275425 -0.259228 -0.221908 -0.187840 -0.403957 -0.011516 -0.453876 -0.461106 -0.308476 0.210506 -0.008275 -0.449401 0.241462 0.290930 0.235536 0.278157 0.237601 0.249858 0.233097 0.228467 0.304148 0.366114
chargesum: 0.00000
title: Mulliken charges with hydrogens summed into heavy atoms:
elementType: I O O O N N C C C C C C C C
charge: 0.165131 -0.275425 -0.259228 -0.221908 -0.187840 -0.037843 0.279414 0.059818 0.026354 0.153088 0.210506 0.295873 -0.449401 0.241462
polarizability: 1.87088140e+02 -8.47989050e+00 1.32450399e+02 6.84123401e+00 2.78275400e+00 6.80811692e+01
1716.lowfreq: -10.6286 -3.0066 -0.0001 0.0004 0.0005 4.5527 34.2382 53.7755 77.2265
frequency: 33.7404 53.7616 77.2196 107.0787 131.3066 168.4111 193.7070 203.3807 242.1701 272.4546 292.1732 377.5606 395.4133 420.9132 510.4797 580.9078 598.9286 616.9336 691.8913 705.2080 712.1404 742.1325 764.7826 775.7382 830.3161 880.0202 887.7181 920.3946 928.2726 943.6438 979.6336 1030.7046 1043.3656 1067.7446 1105.9805 1145.1719 1152.9968 1167.4090 1215.4892 1240.2554 1260.3903 1301.3397 1303.8767 1317.1820 1336.7049 1342.0649 1360.8955 1397.8805 1465.7514 1476.9700 1491.8457 1583.4721 1633.1418 1648.2149 3013.1982 3023.7294 3032.1336 3075.6624 3082.6786 3098.9532 3120.6168 3189.1721 3520.8378
redmass: 4.4352 4.5521 4.6332 7.2522 6.2211 4.6797 14.4287 3.3825 4.4358 5.3692 9.8397 5.0322 6.5129 3.7982 3.9295 6.5140 2.9644 4.4585 2.0156 4.5216 9.2810 7.2380 4.3046 2.5417 3.0570 2.2794 1.6133 2.5205 1.4287 2.1872 3.4544 3.8521 2.4553 2.4791 1.9527 2.2979 1.4031 2.2703 1.3693 1.9764 1.7143 1.5043 1.5241 1.2852 1.6702 1.5955 1.5847 2.6549 1.0857 1.0901 1.0943 6.6541 12.7370 5.8426 1.0596 1.0647 1.0653 1.0895 1.1036 1.1050 1.1015 1.0926 1.0770
irintensity: 1.5832 1.4392 0.0791 1.3536 3.5145 3.2044 4.3947 4.9797 5.6566 0.8756 5.3837 5.8548 10.2537 7.5985 17.0737 19.6734 8.5636 14.1755 13.8724 1.4869 2.4258 13.6217 7.4584 134.1186 16.6107 3.5446 4.1288 13.4215 23.9536 18.6122 35.2714 167.0842 28.6715 10.2962 18.5237 14.8899 19.2394 34.9801 13.2673 178.1217 38.1813 23.2078 29.3661 6.6319 27.6163 11.5443 8.3860 80.4927 17.1551 14.2127 4.3478 24.3885 310.6595 739.8881 60.2254 15.2665 14.5395 13.9955 7.2424 38.1935 19.1224 12.2177 62.5463
temp: 298.150 k
press: 1.00000 atm
elementType: 53 8 8 8 7 7 6 6 6 6 6 6 6 6 1 1 1 1 1 1 1 1 1
symmnumber: 1
zpe: 444318.6 jmol-1
zpe.correction: 0.169232 hartree
zpe.thermalcorrener: 0.181981 hartree
zpe.thermalcorrenthalpy: 0.182925 hartree
zpe.thermalcorrgfe: 0.127434 hartree
zpe.sumelectzpe: -655.905350 hartree
zpe.sumelectthermal: -655.892601 hartree
zpe.sumelectthermalent: -655.891657 hartree
zpe.sumelectthermalfe: -655.947148 hartree
dipole: -4.5427 -4.1449 1.2160
dipole: 6.2686
quadrupole: -94.6388 -97.6683 -97.4792
quadrupole: 3.4402 -6.5771 -3.5711
quadrupole: 1.9566 -1.0729 -0.8838 3.4402 -6.5771 -3.5711
hfenergy: -656.0745821 hartree
pointgroup: C01 [X(C8H9I1N2O3)]
dipole: -2.4100137 0.4410967 -0.28243 debye
dipolederiv: -0.0179431 -0.0921455 -0.0016493 -0.189668 -0.2475542 -0.0222451 -0.0126006 -0.0352176 0.0572096 -0.9042229 0.1336784 -0.0274059 0.4304884 -0.5373181 -0.0197146 0.0056852 -0.0240084 -0.4642562 -0.7044303 -0.2893192 0.0100306 -0.3858381 -1.3215947 -0.0288864 -0.0088482 -0.0600351 -0.3701113 -1.2498306 0.0055263 0.2038167 0.0672844 -0.4325187 -0.0286776 0.250506 -0.0149521 -0.4098688 -1.0630144 0.1237822 0.1476704 -0.7876078 -1.3240499 -0.0361355 0.0127899 -0.2379536 -0.210576 -0.9416757 -0.2668675 0.0842995 -0.4461679 -0.7132914 0.0524573 0.0851722 0.0121226 -0.3595912 1.432512 -0.02 -0.101732 -0.2797216 0.4285529 -0.0017848 -0.3769386 0.0716237 0.4542824 -0.0315613 0.0402801 -0.0481826 0.0195348 0.020216 -0.0145719 -0.0231845 -0.0793404 -0.0847499 0.0412994 0.0636486 -0.0507382 0.0353539 -0.0630321 -0.0738511 -0.0595168 -0.0062988 -0.0410399 0.6726397 -0.1378819 0.0329989 -0.1720246 0.3518236 -0.038411 0.2642033 -0.1156711 0.2668656 1.1277736 0.0610754 -0.1585187 0.400131 1.8815571 0.0956534 -0.1048692 0.2135744 0.3461577 0.6629989 0.2611113 -0.0857042 0.7943611 0.4022377 -0.0644337 -0.0459615 -0.0010949 0.0436945 -0.6689985 0.3746845 0.1397692 0.7045539 0.4992834 0.0029959 0.2509835 0.0566931 -0.2953891 1.573466 -0.1686517 -0.338884 -0.0682599 0.7575458 0.0689415 -0.362796 0.1105178 0.404986 -0.0802633 0.0220525 -0.0085674 -0.0090484 -0.0128143 0.0630466 -0.0161361 0.0563042 0.0008413 -0.1040342 -0.1020477 0.032774 -0.0654534 0.0164248 0.0486636 0.0236574 0.0601631 0.0574779 0.1079527 0.0717806 0.0766848 0.0400759 0.0338638 -0.056409 0.0949141 -0.035301 0.0268149 -0.0128931 -0.0646935 0.1171108 -0.0659183 0.0040918 0.0352935 0.0989229 0.0311002 0.0098785 -0.0767345 0.0080426 -0.1152865 0.0067486 0.1089571 0.0088166 -0.1060172 0.0079952 0.0174634 0.0580966 -0.0581682 -0.0186117 0.0332652 -0.1404434 0.0023131 -0.0304905 0.0092722 0.0697543 -0.2050972 0.0330311 0.0643195 -0.0320399 0.0627719 0.0284941 0.0339715 0.0139275 0.0122505 0.2106544 0.07189 0.0169971 0.0384574 0.049655 -0.0082834 -0.0076667 -0.0264346 0.1423535 0.1733058 -0.0708087 0.028809 -0.0685066 0.1756359 -0.0132715 0.0342198 -0.0069865 0.3255523 unknown
polarizability: 162.1066482|29.6790812|155.5680955|-9.021497|8.2543671|69.9449647 unknown
InChI: InChI=1S/C8H9IN2O3/c9-5-4-11(6-2-1-3-14-6)8(13)10-7(5)12/h4,6,10H,1-3H2
charge 0 multiplicity 1
23 atoms
I  2.467618 3.087267 0.193571
O  -2.289011 0.651504 1.214952
O  -0.06576 -2.63002 -0.151319
O  3.696774 0.098934 -0.707194
N  -0.29703 -0.326221 0.257128
N  1.785611 -1.209247 -0.414247
C  -1.755892 -0.559976 0.624411
C  -2.624356 -0.866527 -0.616161
C  -3.071468 0.543291 -1.078779
C  -3.266067 1.281782 0.258855
C  0.444522 -1.475317 -0.106953
C  0.288318 0.929669 0.348651
C  1.611677 1.150603 0.038409
C  2.47964 0.044397 -0.389799
H  -1.760639 -1.368478 1.372452
H  -3.493991 -1.466137 -0.29289
H  -2.076462 -1.441231 -1.376703
H  -2.283222 1.023327 -1.685477
H  -3.996969 0.514944 -1.676654
H  -3.037672 2.359906 0.223187
H  -4.276999 1.131105 0.678829
H  -0.37861 1.714754 0.710158
H  2.34759 -2.022826 -0.686527
