program: Gaussian 09
title: 000276103
version: EM64L-G09RevD.01
frameworkgroup: C1[X(C19H22N2O2)]
method: RPBEPBE
basis: SDD
operation: Freq
keyword: #p
keyword: freq=noraman
keyword: PBEPBE/SDD
title: #p freq=noraman PBEPBE/SDD
converged: YES YES NO NO
title: Mulliken charges:
elementType: O O N N C C C C C C C C C C C C C C C C C C C H H H H H H H H H H H H H H H H H H H H H H
charge: -0.296364 -0.272821 -0.453809 -0.416560 -0.028658 -0.419069 -0.554797 -0.490386 0.374731 0.231574 -0.413208 -0.418932 -0.274472 0.473326 -0.216416 -0.345690 -0.426892 -0.374262 -0.320949 0.233385 0.179047 -0.257323 -0.666522 0.240984 0.203382 0.213810 0.220204 0.227780 0.241858 0.217953 0.285748 0.295407 0.224857 0.213933 0.222745 0.220174 0.233910 0.218984 0.265628 0.268177 0.217441 0.233613 0.213628 0.251147 0.223704
chargesum: 0.00000
title: Mulliken charges with hydrogens summed into heavy atoms:
elementType: O O N N C C C C C C C C C C C C C C C C C C C
charge: -0.296364 -0.272821 -0.168061 -0.121153 0.212327 -0.001877 -0.106813 -0.030575 0.374731 0.231574 -0.188351 -0.205000 -0.051727 0.473326 0.003759 -0.111780 -0.207908 -0.108634 -0.052771 0.233385 0.179047 0.193730 0.021957
polarizability: 3.57860881e+02 -6.24749866e+00 1.92265576e+02 5.74669281e+00 2.35817359e+01 1.80424712e+02
1716.lowfreq: -0.0010 -0.0008 -0.0003 1.9031 4.9250 13.0243 17.7830 25.7980 31.3221
frequency: 16.3186 24.7255 31.1913 44.9761 56.2838 66.5028 87.3192 100.9913 121.5263 147.7373 165.1041 200.1921 216.2586 233.1112 261.6414 274.2727 297.7130 316.2497 326.9634 367.5048 398.8688 408.9689 419.2091 427.3851 447.0327 462.9109 475.7371 492.7638 510.3604 527.1246 536.0265 570.9870 579.1116 609.0825 632.7079 638.8601 676.3751 717.4743 726.8751 730.9562 749.8708 752.7073 789.7132 810.9019 816.5728 819.9156 837.1500 843.8653 845.1961 883.9414 910.4173 928.6856 937.6149 963.9764 973.3124 983.0637 991.6079 998.7220 1010.1915 1033.3342 1039.5576 1056.1341 1072.5117 1095.3837 1102.5811 1119.5609 1138.2954 1146.5690 1153.5913 1169.2220 1176.2273 1185.1767 1203.6859 1215.4800 1254.4891 1258.9141 1270.5017 1279.8403 1289.5131 1291.7899 1296.1209 1316.7902 1333.6303 1349.9447 1356.0107 1357.7909 1361.1523 1381.8972 1384.8464 1388.4895 1427.9323 1436.7290 1454.0958 1458.7015 1461.3818 1462.5268 1467.9132 1475.2311 1481.6673 1484.8057 1502.1232 1524.2119 1574.9710 1594.5887 1613.2420 1621.2132 1630.8109 2899.3730 2962.4221 2976.5318 2988.7649 2990.6091 3026.3245 3030.9884 3050.6910 3058.3036 3085.1470 3089.9358 3108.1541 3111.9156 3115.6728 3115.9833 3135.9098 3144.9845 3161.3404 3165.5834 3174.9723 3533.0325 3562.7337
redmass: 5.5027 3.7349 3.9900 3.8014 3.9846 4.5343 5.8189 4.8006 3.5165 3.3242 4.4322 3.2145 1.4701 2.6593 3.0905 2.5926 5.1238 3.5734 4.0752 3.4529 3.6732 1.3689 2.2018 2.9857 3.0868 3.4470 4.3565 1.4837 2.9205 1.9062 3.4844 4.1868 3.8120 4.5619 4.5168 4.6607 4.0393 2.6348 3.8453 3.5622 1.4516 4.6514 2.8401 1.9339 1.7532 1.2628 1.8339 3.2857 1.5142 2.8237 2.2539 1.6196 1.6416 1.3045 1.3522 1.3486 3.5233 3.1944 2.5352 2.4777 2.1490 4.5446 2.1308 2.1471 2.4566 1.5401 1.7658 2.0663 1.6651 1.0869 1.3930 1.1608 2.0766 1.4798 1.2883 2.9447 1.3415 1.1169 1.6720 1.3057 1.7403 1.5937 1.5554 1.4105 1.3777 1.2961 1.5488 2.4124 4.5173 1.2382 2.0617 3.6744 1.1083 1.1151 1.1298 1.0441 1.2116 1.7085 1.9788 1.0539 2.9819 3.0877 5.1275 6.0517 8.6991 6.7902 6.5386 1.0823 1.0657 1.0626 1.0608 1.0361 1.0588 1.0943 1.1023 1.1010 1.0979 1.1033 1.0865 1.0893 1.1040 1.0911 1.0923 1.0876 1.0998 1.0958 1.0946 1.0757 1.0770
irintensity: 0.1493 0.9119 0.6190 1.2695 0.2671 2.3999 0.2739 0.7459 1.7200 3.1044 2.6219 1.6672 2.7200 0.2108 1.7938 4.2384 2.5938 10.5754 13.0432 3.7606 25.3444 161.0692 46.1073 4.2368 11.0302 10.3811 11.9664 28.7750 5.5874 21.4992 3.8995 8.3762 0.1554 13.0948 2.8337 5.0777 27.9401 8.0523 4.4628 14.8966 87.8325 17.8929 2.5289 3.3843 0.2316 0.1447 76.7808 4.3532 2.4039 8.6369 8.1625 4.7708 5.3823 0.0225 0.8852 0.2781 12.2516 6.3662 24.4432 9.0064 1.7006 449.4043 7.6626 24.3518 26.9916 17.2645 9.5634 5.5055 75.8045 7.1979 22.0421 182.7338 2.0088 8.8635 28.9878 390.7868 11.8805 0.5506 39.1071 62.8344 58.6310 33.4062 12.9557 25.9136 6.9419 20.7279 184.1421 66.4413 24.4114 22.0952 6.0211 3.2917 39.5062 2.8064 14.1371 13.9493 48.1584 5.4598 103.7632 16.0982 209.3631 137.1711 43.1509 11.4676 411.5134 147.0344 233.4678 75.5098 32.5535 37.2109 46.7703 28.2188 43.2039 40.2751 8.2820 67.0627 41.7805 4.3801 24.4963 4.2767 24.4923 28.2597 28.5953 6.3011 33.3801 19.9871 2.5541 45.9225 44.8219
temp: 298.150 k
press: 1.00000 atm
elementType: 8 8 7 7 6 6 6 6 6 6 6 6 6 6 6 6 6 6 6 6 6 6 6 1 1 1 1 1 1 1 1 1 1 1 1 1 1 1 1 1 1 1 1 1 1
symmnumber: 1
zpe: 977548.7 jmol-1
zpe.correction: 0.372329 hartree
zpe.thermalcorrener: 0.393573 hartree
zpe.thermalcorrenthalpy: 0.394517 hartree
zpe.thermalcorrgfe: 0.319662 hartree
zpe.sumelectzpe: -995.519610 hartree
zpe.sumelectthermal: -995.498366 hartree
zpe.sumelectthermalent: -995.497422 hartree
zpe.sumelectthermalfe: -995.572277 hartree
dipole: 0.7853 -0.9408 3.2012
dipole: 3.4277
quadrupole: -140.7164 -129.7751 -133.4635
quadrupole: -13.7188 -8.4549 3.5914
quadrupole: -6.0648 4.8766 1.1882 -13.7188 -8.4549 3.5914
hfenergy: -995.8919391 hartree
pointgroup: C01 [X(C19H22N2O2)]
dipole: -0.2927474 -0.4528273 1.2360791 debye
polarizability: 356.7541175|-8.0934206|211.0814477|-14.2055268|0.0000191|162.7156033 unknown
InChI: InChI=1S/C19H22N2O2/c1-2-23-19(22)15-8-10-16(11-9-15)20-13-17-12-7-14-5-3-4-6-18(14)21-17/h3-6,8-11,17,20-21H,2,7,12-13H2,1H3
charge 0 multiplicity 1
45 atoms
O  5.585051 -1.150008 -0.958225
O  5.187166 1.065025 -1.595276
N  -2.787616 -0.437587 0.383003
N  -0.205753 -0.489191 1.737717
C  -2.133304 0.827118 0.741595
C  -3.207658 1.879405 1.094512
C  -4.209892 2.046273 -0.07037
C  -1.18374 0.587435 1.945695
C  -4.772147 0.703211 -0.522654
C  -4.015179 -0.489326 -0.297697
C  -6.020761 0.605697 -1.174154
C  -4.527332 -1.737833 -0.751681
C  -6.531156 -0.632542 -1.62661
C  1.009264 -0.350238 1.063047
C  -5.770034 -1.806188 -1.411852
C  1.376601 0.856704 0.392748
C  1.924808 -1.448977 1.038856
C  2.613488 0.951177 -0.264236
C  3.154251 -1.345617 0.374934
C  3.519774 -0.141224 -0.288098
C  4.806421 0.020548 -1.002181
C  6.915283 -1.078557 -1.628589
C  7.977536 -0.524041 -0.673926
H  -1.534846 1.21501 -0.115894
H  -2.717304 2.84532 1.320122
H  -3.745625 1.549778 2.005077
H  -3.697292 2.545144 -0.919081
H  -5.034219 2.718724 0.232667
H  -1.805399 0.313514 2.817677
H  -0.664087 1.536074 2.189612
H  -2.178227 -1.256297 0.333235
H  -0.333202 -1.343811 2.279419
H  -6.60214 1.523071 -1.335746
H  -3.94602 -2.65322 -0.580514
H  -7.499934 -0.681903 -2.134277
H  -6.145366 -2.777082 -1.755468
H  0.699671 1.715689 0.386329
H  1.657769 -2.382661 1.550418
H  2.901826 1.875535 -0.776306
H  3.848003 -2.190697 0.360446
H  7.121342 -2.123257 -1.913437
H  6.822749 -0.447725 -2.530156
H  8.970965 -0.556053 -1.159428
H  7.7554 0.523871 -0.411964
H  8.025863 -1.122492 0.252408
