program: Gaussian 09
title: 000276082
version: EM64L-G09RevD.01
frameworkgroup: C1[X(C10H20O2)]
method: RPBEPBE
basis: SDD
operation: Freq
keyword: #pfreq=noraman
keyword: PBEPBE/SDD
title: #p freq=noraman PBEPBE/SDD
converged: YES YES NO NO
title: Mulliken charges:
elementType: O O C C C C C C C C C C H H H H H H H H H H H H H H H H H H H H
charge: -0.435809 -0.448917 0.283362 -0.039002 -0.088891 -0.589194 -0.522027 -0.437593 -0.753447 -0.773036 -0.343404 -0.352359 0.236649 0.213524 0.207787 0.237147 0.210665 0.206711 0.221427 0.219497 0.217086 0.202377 0.216334 0.220167 0.215362 0.210028 0.195003 0.216294 0.194371 0.189681 0.330388 0.339819
chargesum: 0.00000
title: Mulliken charges with hydrogens summed into heavy atoms:
elementType: O O C C C C C C C C C C
charge: -0.105422 -0.109098 0.283362 0.197647 0.124633 -0.144260 -0.104650 0.003331 -0.117650 -0.127478 0.067893 0.031693
polarizability: 1.33990333e+02 3.38691916e+00 1.06842356e+02 -2.53165620e-01 2.38936312e-01 9.78742109e+01
1716.lowfreq: -15.6548 -6.4975 -0.0002 0.0007 0.0008 11.8322 40.9276 46.9094 75.5245
frequency: 40.8625 46.8082 75.4427 97.8849 115.1770 155.6676 181.0697 190.1562 235.5511 253.5071 268.6461 275.5685 286.4775 299.2178 321.0270 356.7857 360.1045 414.6930 472.4426 512.8470 515.9111 601.7877 664.5472 749.1123 812.0050 831.7299 888.7570 906.7463 923.3195 930.3720 946.5797 966.3182 978.7722 1000.0939 1007.9812 1027.6761 1036.7763 1068.1022 1078.8374 1111.8045 1126.4482 1148.3377 1162.6982 1170.1617 1201.0187 1210.0283 1231.4326 1233.7486 1249.8478 1255.1307 1282.7247 1285.7400 1304.3307 1317.9088 1325.3388 1350.2587 1370.3745 1374.4448 1385.1066 1391.8920 1410.9658 1451.8984 1460.0431 1464.9580 1465.8869 1469.2917 1474.6351 1480.4994 1484.5436 1493.1136 2929.9995 2945.9648 2958.7803 2960.3621 2966.0694 2970.7347 2977.1590 2988.4256 2992.2330 2995.6712 3016.3921 3048.5034 3049.6914 3058.5229 3061.1404 3065.8982 3070.0563 3076.1239 3556.4807 3563.1716
redmass: 4.9144 4.8930 3.7850 2.2176 3.0386 2.4089 2.7139 1.0868 2.5704 1.8656 2.1249 1.0977 1.8644 1.5845 1.3429 2.2153 2.8073 2.8127 2.1438 2.4618 2.6404 2.7182 2.7504 2.1123 1.2219 2.0771 1.9486 1.7181 2.2355 1.4029 1.9618 3.2769 1.2393 2.1272 2.0913 2.8951 1.6064 2.1429 1.9651 1.3867 1.6165 2.3919 1.3008 1.9275 1.5854 1.3219 1.5011 1.3392 2.6992 1.3223 1.3435 1.2890 1.3548 1.3174 1.4093 1.4709 1.3111 1.2410 1.4929 1.2164 1.4397 1.0842 1.0748 1.0822 1.0716 1.0739 1.0794 1.0770 1.0616 1.0614 1.0550 1.0643 1.0374 1.0687 1.0758 1.0431 1.1034 1.0636 1.0664 1.0777 1.0937 1.0985 1.1021 1.0986 1.0995 1.0988 1.1031 1.0950 1.0660 1.0664
irintensity: 1.9584 3.1021 0.3224 12.4755 3.2122 2.9040 1.1651 0.4104 2.1543 16.1771 5.1451 135.7420 4.2213 12.8148 160.2329 1.5758 0.9595 3.7382 8.1102 14.3542 2.9113 8.7824 2.9373 4.4551 1.5036 7.1203 2.0240 5.3753 33.2407 1.9075 3.3143 25.6164 1.7750 124.5787 14.7994 6.0528 7.4380 3.5552 8.3670 8.1955 2.5308 1.3801 4.7034 14.4916 9.8080 20.8801 16.3526 1.0670 5.8737 0.7592 1.7045 3.4363 3.9705 5.7263 5.8646 5.4305 5.8049 26.6129 9.8913 15.8811 3.7449 9.6460 3.8338 3.4216 7.3233 10.1999 9.6747 4.7500 8.8981 10.7242 60.0534 30.4939 40.8192 87.2158 37.1430 14.9646 48.0734 6.5801 48.2328 26.5806 43.8723 18.7127 50.4582 56.9070 26.7949 58.5760 61.4710 41.1879 3.8866 1.9701
temp: 298.150 k
press: 1.00000 atm
elementType: 8 8 6 6 6 6 6 6 6 6 6 6 1 1 1 1 1 1 1 1 1 1 1 1 1 1 1 1 1 1 1 1
symmnumber: 1
zpe: 743427.4 jmol-1
zpe.correction: 0.283157 hartree
zpe.thermalcorrener: 0.297940 hartree
zpe.thermalcorrenthalpy: 0.298884 hartree
zpe.thermalcorrgfe: 0.241702 hartree
zpe.sumelectzpe: -542.462167 hartree
zpe.sumelectthermal: -542.447384 hartree
zpe.sumelectthermalent: -542.446439 hartree
zpe.sumelectthermalfe: -542.503621 hartree
dipole: -0.3827 -0.0957 0.0634
dipole: 0.3995
quadrupole: -78.0850 -75.2912 -75.8133
quadrupole: 16.1334 -7.8026 2.4158
quadrupole: -1.6885 1.1053 0.5832 16.1334 -7.8026 2.4158
hfenergy: -542.7453236 hartree
pointgroup: C01 [X(C10H20O2)]
dipole: 0.1513666 -0.0411748 -0.0100369 debye
polarizability: 133.9319554|-3.0937682|106.2791355|1.9554165|-2.236795|98.4958091 unknown
InChI: InChI=1S/C10H20O2/c1-10(2)8(3-5-11)7-9(10)4-6-12/h8-9,11-12H,3-7H2,1-2H3
charge 0 multiplicity 1
32 atoms
O  4.001728 0.588648 0.695306
O  -4.639792 -0.023647 -0.596748
C  0.040627 0.456518 -0.197724
C  1.151786 -0.528065 0.37944
C  -1.030036 -0.445827 0.562559
C  0.033363 -1.591985 0.636285
C  2.371502 -0.931484 -0.460821
C  -2.403758 -0.757267 -0.050163
C  0.132393 1.920577 0.271373
C  -0.096066 0.385155 -1.73299
C  3.429106 0.181385 -0.601997
C  -3.359033 0.440805 -0.032267
H  1.50966 -0.121113 1.346322
H  -1.174018 -0.024623 1.58001
H  -0.0682 -2.294872 -0.21324
H  0.087733 -2.175159 1.571126
H  2.052835 -1.245851 -1.475146
H  2.848916 -1.824038 0.000197
H  -2.299484 -1.11253 -1.092591
H  -2.878366 -1.581557 0.518875
H  1.012099 2.431046 -0.165359
H  -0.7689 2.493836 -0.023428
H  0.228968 1.979872 1.371542
H  -0.159061 -0.654671 -2.102786
H  -1.007541 0.91374 -2.0706
H  0.768233 0.866708 -2.228714
H  4.235279 -0.138776 -1.296795
H  2.97748 1.106046 -0.998568
H  -2.946123 1.276844 -0.637666
H  -3.4959 0.800329 1.011591
H  4.426693 -0.204189 1.110945
H  -5.288421 0.724746 -0.600769
