program: Gaussian 09
title: 000276108
version: EM64L-G09RevD.01
frameworkgroup: C1[X(C21H19NO2)]
method: RPBEPBE
basis: SDD
operation: Freq
keyword: #p
keyword: freq=noraman
keyword: PBEPBE/SDD
title: #p freq=noraman PBEPBE/SDD
converged: YES YES NO NO
title: Mulliken charges:
elementType: O O N C C C C C C C C C C C C C C C C C C C C C H H H H H H H H H H H H H H H H H H H
charge: -0.476220 -0.422076 -0.166091 0.008958 -0.619549 0.386945 0.378459 0.177544 -0.411167 -0.405090 -0.382670 -0.389741 0.306867 -0.252217 -0.225428 -0.231509 -0.242385 -0.245700 -0.243657 -0.336245 -0.364087 -0.241874 -0.249705 -0.230710 0.270153 0.240566 0.239524 0.289326 0.274771 0.251158 0.361694 0.223990 0.222687 0.223459 0.222469 0.226178 0.224981 0.281584 0.254646 0.230924 0.231082 0.233635 0.374520
chargesum: 0.00000
title: Mulliken charges with hydrogens summed into heavy atoms:
elementType: O O N C C C C C C C C C C C C C C C C C C C C C
charge: -0.114526 -0.047556 -0.166091 0.008958 -0.108829 0.386945 0.378459 0.177544 -0.171644 -0.115764 -0.107899 -0.138583 0.306867 -0.028226 -0.002741 -0.008049 -0.019916 -0.019522 -0.018676 -0.054661 -0.109441 -0.010950 -0.018622 0.002925
polarizability: 2.66425989e+02 1.82738711e+01 2.37271713e+02 -3.07303736e+01 1.38812026e+01 2.02154482e+02
1716.lowfreq: -8.6057 -0.0007 -0.0005 -0.0003 6.7753 9.1918 13.4084 28.0322 36.9338
frequency: 12.7519 28.0037 36.8976 40.6494 50.3382 58.3107 71.6290 126.8121 156.8690 192.3692 202.5378 224.4369 241.0943 241.3931 269.3356 283.9915 311.8393 345.7077 364.2045 397.2988 402.3641 403.2617 404.7745 446.0925 448.5869 476.1308 514.0176 542.2091 576.0641 612.5342 614.5288 616.6386 616.8788 622.0788 671.0269 696.1029 704.2835 707.1682 714.6241 729.9034 746.3750 763.0493 774.0280 780.6364 848.0986 854.3022 855.5697 860.6247 899.6694 928.8713 930.8198 934.5202 946.0761 979.1817 980.3177 983.6585 988.8463 989.8926 990.1030 996.2104 999.0104 1000.0952 1008.9728 1015.6181 1027.9747 1030.9654 1038.0852 1062.0853 1080.8535 1092.3384 1101.3944 1164.6934 1170.0441 1171.2872 1176.1800 1180.2540 1189.5820 1191.8731 1203.0441 1240.1896 1263.3786 1287.7358 1307.2900 1311.4712 1318.6085 1337.3301 1378.2478 1378.5835 1379.6453 1404.9255 1432.6071 1435.4136 1436.8318 1451.5980 1478.8660 1480.4717 1483.9919 1578.8811 1589.1568 1590.5778 1591.4336 1608.3399 1609.4880 1612.2346 2993.6405 3061.3011 3118.6649 3119.0153 3127.2462 3127.7364 3128.7310 3139.0466 3140.0268 3140.4481 3152.1313 3154.3494 3156.7908 3165.8052 3166.2760 3175.5048 3199.2358 3235.0031 3558.0407
redmass: 5.4164 3.9249 4.0678 3.8109 5.1324 5.6477 4.9093 4.6514 5.1538 5.4003 5.1111 5.0033 4.9008 5.6823 6.3367 4.8312 5.6744 5.1638 2.6547 2.1274 1.8892 2.8275 2.8812 3.8966 2.1567 4.9330 4.7512 4.0312 3.6908 4.4846 6.0323 6.4149 5.8064 4.7875 5.6093 1.7112 1.7060 1.9631 3.5350 1.8040 1.8797 1.9053 2.0165 2.0777 1.5357 1.9429 1.2958 1.2751 2.3606 1.7507 1.5246 2.0395 3.0513 1.3815 1.3991 1.3945 5.8906 5.8180 5.7945 1.3334 1.4103 1.3424 3.0770 3.7449 2.1303 2.3679 2.1388 2.3613 1.5807 1.6654 1.9575 1.9675 1.1111 1.0971 1.0609 1.5456 1.4425 1.1197 1.1341 2.4955 1.8105 1.6147 1.2821 1.3542 1.3359 1.4034 6.5322 7.1930 7.5847 1.4832 2.1990 2.1228 2.2533 1.1539 2.2545 2.1996 2.0162 5.4126 6.1104 5.9358 6.3003 6.0813 5.8794 6.0751 1.0634 1.0966 1.0844 1.0843 1.0881 1.0877 1.0851 1.0890 1.0938 1.0932 1.0941 1.0962 1.0989 1.1000 1.0991 1.0953 1.0949 1.0654 1.0675
irintensity: 0.0367 0.0678 0.2374 0.1531 0.0364 0.3077 0.7256 0.9087 0.7864 1.8577 4.8295 1.5410 0.4254 3.3202 0.9977 1.1964 3.8915 9.9634 3.0513 26.5632 50.2570 0.6344 0.0948 4.1491 25.6216 0.2733 9.6241 4.8532 13.4289 44.9776 4.0470 0.4567 12.6014 5.1924 7.8161 44.3132 60.6293 46.3932 21.1480 121.5752 88.9773 48.8914 12.8637 50.0190 7.1695 12.6177 1.5941 1.2954 5.0946 34.3973 8.6487 14.6054 57.9298 0.0592 0.4757 0.3031 0.4078 0.3562 0.1993 1.0911 4.5766 2.1783 29.0245 44.9199 13.0131 22.9162 3.4106 10.7702 1.5322 2.7605 1.4586 10.9407 1.3711 1.2410 0.1924 14.5011 10.8951 0.8979 3.9174 35.0487 28.4245 33.2996 62.8757 6.2161 1.5163 2.3390 3.4040 6.6728 3.6326 110.4041 2.4420 27.1975 28.0639 48.2345 21.7378 9.2335 5.3466 6.0677 3.5706 5.3188 0.1359 8.9861 0.4581 3.1254 10.6014 8.1879 2.4685 2.3180 3.9600 7.3272 0.5736 8.4975 32.4698 39.2161 29.7934 23.5319 32.5157 26.1287 13.2719 10.7928 3.5949 387.5137 55.1916
temp: 298.150 k
press: 1.00000 atm
elementType: 8 8 7 6 6 6 6 6 6 6 6 6 6 6 6 6 6 6 6 6 6 6 6 6 1 1 1 1 1 1 1 1 1 1 1 1 1 1 1 1 1 1 1
symmnumber: 1
zpe: 898139.7 jmol-1
zpe.correction: 0.342083 hartree
zpe.thermalcorrener: 0.362663 hartree
zpe.thermalcorrenthalpy: 0.363607 hartree
zpe.thermalcorrgfe: 0.290305 hartree
zpe.sumelectzpe: -1015.095096 hartree
zpe.sumelectthermal: -1015.074517 hartree
zpe.sumelectthermalent: -1015.073573 hartree
zpe.sumelectthermalfe: -1015.146875 hartree
dipole: 2.8152 -0.0736 -1.0822
dipole: 3.0169
quadrupole: -132.2814 -128.4774 -132.3614
quadrupole: 2.3622 -1.5515 5.4936
quadrupole: -1.2413 2.5627 -1.3213 2.3622 -1.5515 5.4936
hfenergy: -1015.4371798 hartree
pointgroup: C01 [X(C21H19N1O2)]
dipole: -1.0774588 -0.0846352 0.490676 debye
polarizability: 269.9717184|-20.3119847|221.4903231|-25.5450455|-22.9454436|214.3901434 unknown
InChI: InChI=1S/C21H19NO2/c23-21(18-12-6-2-7-13-18,19-14-8-3-9-15-19)16-20(22-24)17-10-4-1-5-11-17/h1-15,23-24H,16H2
charge 0 multiplicity 1
43 atoms
O  1.154971 -0.131183 -2.186745
O  -2.845832 0.192784 -2.462928
N  -1.518071 -0.084292 -1.926046
C  1.056838 0.005003 -0.7222
C  -0.086161 -0.930598 -0.204386
C  0.843194 1.49128 -0.352577
C  2.386566 -0.52165 -0.138973
C  -1.502521 -0.631742 -0.7219
C  0.009735 1.921396 0.709173
C  3.219045 -1.360684 -0.918664
C  1.551499 2.468701 -1.097922
C  2.76276 -0.223175 1.194674
C  -2.66377 -1.008112 0.131616
C  -0.116956 3.296212 1.017461
C  4.409245 -1.892571 -0.372193
C  1.43089 3.839947 -0.789949
C  3.948872 -0.759974 1.742495
C  0.594455 4.261455 0.271287
C  4.777256 -1.598737 0.960871
C  -3.918506 -0.333259 0.075501
C  -2.511728 -2.074507 1.066631
C  -4.9719 -0.708816 0.935004
C  -3.574719 -2.459532 1.908384
C  -4.810487 -1.774463 1.849999
H  0.195802 -1.959656 -0.502099
H  -0.098507 -0.913971 0.899116
H  -0.559935 1.196001 1.301369
H  2.926617 -1.567581 -1.95158
H  2.186312 2.133711 -1.924384
H  2.1440 0.450035 1.799408
H  0.211729 0.020334 -2.510682
H  -0.771835 3.609828 1.838626
H  5.050133 -2.534202 -0.988146
H  1.987179 4.580562 -1.376126
H  4.23087 -0.516557 2.773356
H  0.497727 5.326506 0.510858
H  5.700786 -2.010788 1.383609
H  -4.059091 0.482047 -0.635292
H  -1.564395 -2.620258 1.125468
H  -5.925116 -0.17099 0.884972
H  -3.438963 -3.290916 2.608617
H  -5.635653 -2.067434 2.508517
H  -2.637535 0.543045 -3.36732
