program: Gaussian 09
title: 000270489
version: EM64L-G09RevD.01
frameworkgroup: C1[X(C23H20O8)]
method: RPBEPBE
basis: SDD
operation: Freq
keyword: #pfreq=noraman
keyword: PBEPBE/SDD
title: #p freq=noraman PBEPBE/SDD
converged: YES YES NO NO
title: Mulliken charges:
elementType: O O O O O O O O C C C C C C C C C C C C C C C C C C C C C C C H H H H H H H H H H H H H H H H H H H H
charge: -0.296632 -0.301983 -0.307518 -0.276279 -0.199238 -0.201096 -0.193534 -0.222151 0.119069 0.506457 0.084582 0.565842 0.157219 -0.830359 0.263332 -0.716727 0.330490 0.509161 -0.616278 -0.505621 0.385140 -0.564351 -0.814155 0.293537 0.274800 0.252706 -0.773774 0.261413 -0.765873 -0.750635 -0.749852 0.257141 0.254075 0.320120 0.252323 0.285253 0.234100 0.228874 0.233339 0.243287 0.259167 0.250712 0.251912 0.251887 0.250518 0.249461 0.252000 0.250645 0.247205 0.253932 0.256359
chargesum: 0.00000
title: Mulliken charges with hydrogens summed into heavy atoms:
elementType: O O O O O O O O C C C C C C C C C C C C C C C C C C C C C C C
charge: -0.296632 -0.301983 -0.307518 -0.276279 -0.199238 -0.201096 -0.193534 -0.222151 0.119069 0.506457 0.084582 0.565842 0.157219 -0.573218 0.263332 -0.462651 0.330490 0.509161 -0.296158 -0.253298 0.385140 -0.279098 -0.117841 0.293537 0.274800 0.252706 -0.020608 0.261413 -0.011557 0.001470 0.007644
polarizability: 4.34473235e+02 -2.53810389e+01 3.44622492e+02 -4.54099667e+00 -4.00143839e-01 1.64948054e+02
1716.lowfreq: -4.4382 -0.0008 -0.0003 0.0005 1.9546 3.8776 15.3026 21.5723 29.4365
frequency: 15.2043 21.4158 29.4264 31.5669 35.1448 41.1156 48.4539 58.8864 63.6867 66.8152 68.6450 79.0434 81.2972 87.8268 92.4270 96.5545 105.5119 113.4198 130.9770 145.1505 176.3852 188.1366 220.0472 231.5654 243.5795 257.5144 264.1243 267.1347 298.8084 307.9616 332.4818 335.5197 338.4418 364.9903 375.7853 397.4795 441.3159 479.2632 502.6335 513.7838 520.6695 536.7062 541.7503 547.2914 550.9135 556.1426 560.0183 572.9620 576.7753 580.8021 600.9622 612.1373 619.6732 662.7618 673.7303 689.8568 703.6142 751.1084 756.1370 785.8624 803.2022 804.0590 825.7685 832.6419 854.3986 885.5043 896.3440 899.1299 912.6098 960.1177 966.8590 973.7634 982.5586 987.1624 990.4938 994.3187 1006.1156 1031.1428 1037.0391 1037.3459 1039.8343 1040.2614 1041.4439 1051.5651 1057.7202 1128.4873 1149.0096 1159.7134 1161.4748 1174.3545 1177.0007 1194.6202 1233.5451 1252.1922 1311.7878 1325.6705 1329.5410 1373.9090 1377.0117 1378.9953 1382.7854 1384.5605 1399.6862 1406.6277 1424.7957 1428.7262 1437.9657 1441.6350 1450.9769 1452.0677 1452.4946 1452.9069 1455.2973 1460.4545 1465.8834 1467.4651 1467.9658 1481.0764 1552.1654 1567.6384 1594.8039 1627.3513 1645.8374 1661.6745 1679.4463 1681.0992 1685.7171 2976.3834 3004.7006 3008.2600 3008.8445 3008.9168 3053.3381 3089.3215 3096.6787 3098.7832 3101.1286 3102.7239 3128.7329 3135.2365 3136.1819 3140.7355 3141.8535 3145.5867 3148.9336 3195.3646 3205.6120
redmass: 5.5259 2.9964 3.7086 3.7134 5.8153 3.2441 5.1489 2.1641 2.3397 2.0070 1.5011 2.4749 1.7761 3.5645 4.2180 3.1311 1.2374 5.4475 1.1289 6.1099 5.5623 4.9115 4.4959 4.9611 4.5644 4.5411 6.3161 5.1405 5.5314 4.3243 6.6042 4.0440 3.7805 5.3497 6.4085 4.2928 5.1697 4.8480 4.5053 5.0387 5.5518 3.9888 4.2624 3.6853 3.2290 4.2908 3.7633 4.7224 4.4606 5.0129 4.9750 5.0376 3.0892 6.4394 5.1243 6.1715 5.9385 5.7811 4.1280 6.1030 4.9800 5.2711 3.9797 6.8265 1.3679 1.6541 3.2310 2.0949 1.4935 1.8837 3.6797 4.3903 2.1155 2.0738 1.9360 2.0272 2.4009 4.4554 2.7157 1.9251 1.7594 1.6438 2.0789 1.5693 3.2076 2.1539 2.6740 3.2557 2.6055 2.6660 2.8109 1.4652 1.6132 2.6798 3.6738 3.6687 3.1200 1.2475 2.9526 1.4170 1.2432 1.2511 1.2349 2.6825 4.4345 7.5578 4.9712 1.0652 1.0527 1.0642 1.0539 1.0464 1.0557 1.0515 1.0733 1.0981 1.8894 1.6779 7.0572 8.7726 6.3882 7.5545 6.9542 9.7421 10.9267 10.6848 10.7678 1.0375 1.0383 1.0374 1.0368 1.0367 1.0974 1.0988 1.0973 1.0946 1.0951 1.0953 1.0921 1.0915 1.1026 1.1020 1.1020 1.1011 1.0920 1.0929 1.0932
irintensity: 0.0010 0.2408 0.5898 3.6186 1.2371 3.9847 1.5454 0.2702 4.1615 2.5192 0.8879 0.1752 1.3548 4.3050 2.6139 1.2263 1.3829 1.2115 0.5984 0.6909 0.6454 1.2017 1.0523 0.2247 2.0633 1.1628 6.1164 4.8588 0.6362 2.2622 0.1219 0.4052 0.6039 1.9626 1.4583 5.2918 5.3869 6.3485 8.1690 16.7736 6.5726 1.0406 0.7224 0.7052 0.5430 2.8429 14.4356 1.3775 15.9723 3.2249 1.7155 9.5793 6.2399 4.9477 1.6552 7.6750 10.9196 17.0224 0.4553 39.9935 61.3968 51.5134 3.5716 62.7394 9.3948 20.0185 0.4542 12.9716 12.4437 55.7678 14.8118 5.5802 37.4017 34.1116 44.7520 16.1150 315.2708 65.0056 136.2086 52.1521 22.9928 10.8335 114.3980 17.5830 79.3085 167.2055 233.5438 445.0564 391.6036 455.2152 348.7514 52.1817 7.3584 45.4119 40.5246 57.6739 52.7477 5.5597 8.4609 8.2364 150.0663 62.1613 8.2927 9.4484 9.1967 30.4855 14.7844 22.1157 18.4813 23.2154 44.3040 19.8177 24.7390 5.7356 1.0112 22.6760 51.5890 2.4135 2.7905 46.3518 46.0260 82.9358 70.4282 135.0809 47.3503 361.2846 94.8656 43.4587 1.8484 1.5535 1.0663 5.6256 17.2676 15.8557 5.6415 6.8371 12.6572 4.6962 9.0242 10.5708 7.0403 13.8159 7.6393 11.4752 5.8072 1.2917 5.0871
temp: 298.150 k
press: 1.00000 atm
elementType: 8 8 8 8 8 8 8 8 6 6 6 6 6 6 6 6 6 6 6 6 6 6 6 6 6 6 6 6 6 6 6 1 1 1 1 1 1 1 1 1 1 1 1 1 1 1 1 1 1 1 1
symmnumber: 1
zpe: 990056.5 jmol-1
zpe.correction: 0.377093 hartree
zpe.thermalcorrener: 0.408430 hartree
zpe.thermalcorrenthalpy: 0.409374 hartree
zpe.thermalcorrgfe: 0.309749 hartree
zpe.sumelectzpe: -1488.055659 hartree
zpe.sumelectthermal: -1488.024322 hartree
zpe.sumelectthermalent: -1488.023378 hartree
zpe.sumelectthermalfe: -1488.123003 hartree
dipole: -2.0834 -2.0806 1.3242
dipole: 3.2285
quadrupole: -141.0837 -148.4098 -198.7546
quadrupole: -0.4091 1.0654 -4.4625
quadrupole: 21.6657 14.3396 -36.0052 -0.4091 1.0654 -4.4625
hfenergy: -1488.432752 hartree
pointgroup: C01 [X(C23H20O8)]
dipole: -0.7140883 -0.9106613 0.5235655 debye
polarizability: 439.0971156|-14.1508562|339.9321856|-6.2702081|-0.4469238|165.0144803 unknown
InChI: InChI=1S/C23H20O8/c1-11-6-16-8-17-9-18(28-12(2)24)10-20(30-14(4)26)22(17)23(31-15(5)27)21(16)19(7-11)29-13(3)25/h6-10H,1-5H3
charge 0 multiplicity 1
51 atoms
O  -1.199357 -1.583522 0.334429
O  -3.747723 -0.730956 0.070915
O  1.362463 -2.350459 0.144487
O  4.849091 0.918615 -0.049705
O  -0.622924 -1.468614 2.607323
O  -3.242594 -1.066655 -2.195514
O  2.635282 -2.947663 -1.750144
O  4.954573 3.266996 -0.220382
C  -1.724024 0.777594 0.042611
C  -1.273199 2.164945 -0.035354
C  0.656261 0.022384 0.065945
C  1.085059 1.416971 -0.027451
C  -0.738735 -0.244288 0.136313
C  0.111413 2.439934 -0.059322
C  -3.156118 0.578006 0.03805
C  -2.23138 3.239317 -0.06213
C  1.713041 -0.967878 0.07578
C  -3.601447 3.003824 -0.017973
C  2.480643 1.768783 -0.069843
C  -4.049738 1.637308 0.021521
C  3.432742 0.760045 -0.025761
C  3.052414 -0.616759 0.041636
C  -4.618942 4.126649 -0.031978
C  -1.109774 -2.104581 1.658448
C  -3.734073 -1.487178 -1.134375
C  1.862489 -3.265822 -0.830819
C  -1.727345 -3.480605 1.709853
C  5.522319 2.159512 -0.14978
C  -4.400996 -2.825329 -0.913967
C  1.279255 -4.634296 -0.56754
C  7.011962 1.90471 -0.155748
H  0.445228 3.483052 -0.100954
H  -1.851895 4.266497 -0.115714
H  2.767504 2.818215 -0.137191
H  -5.121762 1.411975 0.018918
H  3.834986 -1.377516 0.043323
H  -5.301949 4.036681 -0.897828
H  -4.130732 5.114107 -0.08646
H  -5.246984 4.107791 0.878901
H  -1.455302 -4.067896 0.818893
H  -2.827377 -3.377961 1.732018
H  -1.401993 -3.996876 2.624895
H  -3.622031 -3.593314 -0.759277
H  -4.969741 -3.103417 -1.815366
H  -5.060848 -2.80536 -0.033821
H  0.255658 -4.675035 -0.983321
H  1.890854 -5.399328 -1.067951
H  1.218286 -4.833716 0.514049
H  7.548431 2.860883 -0.234132
H  7.311893 1.380947 0.768376
H  7.281732 1.252087 -1.003981
