program: Gaussian 09
title: 000276078
version: EM64L-G09RevD.01
frameworkgroup: C1[X(C8H8F4O4)]
method: RPBEPBE
basis: SDD
operation: Freq
keyword: #pfreq=noraman
keyword: PBEPBE/SDD
title: #p freq=noraman PBEPBE/SDD
converged: YES YES NO NO
title: Mulliken charges:
elementType: F F F F O O O O C C C C C C C C H H H H H H H H
charge: -0.142894 -0.149733 -0.161234 -0.142609 -0.248602 -0.247214 -0.248629 -0.247215 0.189254 0.189268 0.255539 0.269738 -0.318510 -0.303088 -0.318438 -0.303135 0.237131 0.248363 0.234833 0.243430 0.248349 0.237113 0.243444 0.234838
chargesum: 0.00000
title: Mulliken charges with hydrogens summed into heavy atoms:
elementType: F F F F O O O O C C C C C C C C
charge: -0.142894 -0.149733 -0.161234 -0.142609 -0.248602 -0.247214 -0.248629 -0.247215 0.189254 0.189268 0.255539 0.269738 0.166984 0.175175 0.167025 0.175147
polarizability: 1.21578975e+02 1.65084607e-03 8.01107219e+01 5.87083812e-04 1.82483239e+00 8.37002713e+01
1716.lowfreq: -6.1356 0.0001 0.0005 0.0010 4.9191 15.3534 23.8951 35.3397 40.1761
frequency: 23.5942 33.7669 39.7519 152.3832 157.6019 158.5016 159.5931 212.7698 236.1083 236.4634 244.1265 265.9663 275.0501 305.7777 325.7660 387.5175 387.7565 490.0894 517.0851 603.1861 622.7082 623.6709 680.6305 730.2956 792.8825 818.9037 840.4454 856.5824 865.4667 905.5130 906.6616 916.5417 941.6011 956.0902 972.1184 976.3018 993.9812 997.3891 1020.2944 1095.4843 1097.2343 1103.4812 1154.6694 1156.6430 1164.4572 1167.0450 1183.0247 1195.8470 1228.2886 1294.4412 1313.9075 1317.3784 1324.0036 1325.6565 1470.8770 1471.0662 1475.6609 1475.9464 3020.7068 3021.1281 3026.1209 3026.3225 3117.9486 3118.0190 3130.4144 3130.5272
redmass: 6.8869 4.2189 3.4320 4.0549 8.7817 3.4173 6.5597 16.9138 4.0199 8.1246 11.8933 5.6993 4.2277 8.3754 13.6477 15.1948 9.4892 15.8203 11.1696 17.6253 2.4544 2.4220 9.9189 9.4651 8.1979 9.0366 3.7604 2.8072 4.8438 4.6025 11.9002 3.5426 3.3127 2.7047 4.7920 3.4723 7.5213 4.5453 12.0608 1.6202 1.6305 8.3955 1.1361 1.1641 12.2883 6.9772 1.7302 1.4137 3.1507 6.2407 1.2762 1.3520 1.2505 1.2689 1.0894 1.0896 1.1004 1.1011 1.0663 1.0663 1.0601 1.0603 1.1033 1.1032 1.1067 1.1067
irintensity: 5.9667 0.7692 18.6271 0.1459 0.5052 0.7920 0.0234 0.1017 1.8950 4.9937 9.6076 3.0302 1.1096 0.6536 0.3362 0.8537 0.0713 18.0896 5.1805 0.3916 0.4576 15.5239 4.9082 0.1890 1.8200 37.6698 69.9561 0.9280 93.5514 0.6202 0.4376 219.1010 0.4230 29.5948 10.5117 11.2913 206.0039 208.7738 1.0364 6.1678 1.5716 94.0489 1.4699 4.6122 74.8724 5.8401 87.9799 1.6917 23.3165 1.1317 0.0003 5.0097 1.7552 0.1654 0.1383 18.6140 2.8422 0.0623 50.3305 26.6485 33.1147 49.5345 15.5495 4.9882 2.4446 34.8486
temp: 298.150 k
press: 1.00000 atm
elementType: 9 9 9 9 8 8 8 8 6 6 6 6 6 6 6 6 1 1 1 1 1 1 1 1
symmnumber: 1
zpe: 420112.0 jmol-1
zpe.correction: 0.160012 hartree
zpe.thermalcorrener: 0.174576 hartree
zpe.thermalcorrenthalpy: 0.175520 hartree
zpe.thermalcorrgfe: 0.117047 hartree
zpe.sumelectzpe: -1008.583873 hartree
zpe.sumelectthermal: -1008.569309 hartree
zpe.sumelectthermalent: -1008.568365 hartree
zpe.sumelectthermalfe: -1008.626838 hartree
dipole: 0.0006 -1.0531 -1.5000
dipole: 1.8328
quadrupole: -49.5996 -95.7010 -100.5987
quadrupole: 0.0022 0.0011 1.0972
quadrupole: 32.3668 -13.7345 -18.6323 0.0022 0.0011 1.0972
hfenergy: -1008.7438851 hartree
pointgroup: C01 [X(C8H8F4O4)]
dipole: -0.0002335 0.0673256 0.7179165 debye
dipolederiv: -0.3309658 0.0000503 -0.0000124 0.0000181 -0.8112616 -0.0450601 0.0000103 -0.0298967 -0.2728029 -0.3133029 0.0000036 -0.0000727 -0.0000029 -0.2741575 0.026033 -0.0000574 0.019428 -0.751682 -0.3251736 0.000018 -0.0001029 0.0000081 -0.3399761 0.1587717 -0.0001033 0.1706789 -0.7292829 -0.3428199 0.0000218 -0.0000109 -0.0000207 -0.7121996 -0.2132248 -0.0000032 -0.1614306 -0.3366749 -0.9244048 -0.0050709 -0.1420579 -0.0930422 -0.3479845 -0.039661 -0.2284898 -0.0632304 -0.5398559 -1.101442 -0.0088369 0.0887996 0.0695102 -0.3378851 -0.0272343 0.1524728 -0.0446508 -0.4618039 -0.9245928 0.0050799 0.1422408 0.093106 -0.347903 -0.0397005 0.2287256 -0.0632266 -0.539879 -1.1012643 0.0088331 -0.0886698 -0.0695644 -0.3379066 -0.0271981 -0.1523667 -0.0447045 -0.4618064 0.9554642 0.0073357 -0.048074 0.0408017 0.346147 0.082868 -0.0173944 0.0278156 0.5231176 0.9554826 -0.0071658 0.0476994 -0.0405803 0.3461487 0.0828598 0.016833 0.0277944 0.5231759 0.623466 -0.0000728 0.0001354 -0.0000789 0.996825 0.060426 0.000093 0.0527485 0.9846941 0.5759176 -0.0000346 0.0001536 -0.0000362 0.8938694 0.0532848 0.0001653 0.0737482 0.9744543 0.5823806 -0.0271931 0.1485553 -0.1652663 0.2863195 -0.1170174 -0.002434 -0.0541761 0.2069026 0.6256703 0.0554647 -0.0505358 0.2114285 0.2963918 -0.0573246 0.1525515 -0.0361928 0.165045 0.5826478 0.0271895 -0.1487111 0.1652856 0.2862785 -0.1169747 0.0023884 -0.0541837 0.20683 0.6254629 -0.0554883 0.0505589 -0.2115002 0.2964069 -0.0574335 -0.1524084 -0.0362083 0.1651787 -0.0062416 0.0029694 0.0050837 0.0880042 -0.0669941 0.1288684 -0.007279 0.0772037 -0.0086444 -0.0020659 -0.0546141 -0.058321 -0.0840248 0.0123819 -0.0613105 -0.0637071 -0.0308221 0.0749609 -0.0268851 -0.0422165 0.0107515 -0.1372339 -0.0662783 0.0958507 0.0104859 0.0683598 0.0005256 -0.046066 0.063052 0.0220993 0.1047253 0.0013347 -0.0251526 0.0208113 -0.0069378 0.105386 -0.002083 0.0546362 0.0582886 0.0840619 0.0122876 -0.0612919 0.0636772 -0.0308097 0.0750014 -0.0063403 -0.0030657 -0.0049724 -0.0880974 -0.0669532 0.12889 0.0073541 0.0772267 -0.0086893 -0.0460591 -0.0630451 -0.0221313 -0.1046893 0.0014174 -0.0251639 -0.0208496 -0.0069355 0.1053825 -0.026785 0.0421495 -0.0106937 0.1371879 -0.0663088 0.0958951 -0.0104755 0.0684017 0.0004667 unknown
polarizability: 121.5789748|-0.0023231|79.818611|0.0014105|1.4819371|83.9923823 unknown
InChI: InChI=1S/C8H8F4O4/c9-5(10)7(13-1-2-14-7)6(11,12)8(5)15-3-4-16-8/h1-4H2
charge 0 multiplicity 1
24 atoms
F  -0.000263 2.220893 -0.733749
F  -0.000373 0.725148 -2.440012
F  0.000501 -1.328024 1.513957
F  0.00024 -2.267686 -0.552097
O  1.785537 0.70175 0.71328
O  2.132305 -0.62618 -1.19456
O  -1.785455 0.70129 0.713761
O  -2.132218 -0.626735 -1.194043
C  1.138137 -0.026536 -0.346427
C  -1.138062 -0.02683 -0.346078
C  -0.000158 0.850347 -1.032971
C  0.000216 -1.036076 0.132755
C  3.177002 0.16632 0.773993
C  3.461295 -0.149522 -0.702902
C  -3.177217 0.16653 0.7740
C  -3.461164 -0.149412 -0.702912
H  3.201341 -0.736953 1.410291
H  3.798699 0.96665 1.20012
H  3.760225 0.747702 -1.273289
H  4.170347 -0.974784 -0.864687
H  -3.798681 0.967227 1.199789
H  -3.202215 -0.736621 1.410439
H  -4.170488 -0.974421 -0.864799
H  -3.759551 0.747826 -1.273561
