program: Gaussian 09
title: 000276062
version: EM64L-G09RevD.01
frameworkgroup: C1[X(C5H8ClN5O)]
method: RPBEPBE
basis: SDD
operation: Freq
keyword: #p
keyword: freq=noraman
keyword: PBEPBE/SDD
title: #p freq=noraman PBEPBE/SDD
converged: YES YES NO NO
title: Mulliken charges:
elementType: Cl O N N N N N C C C C C H H H H H H H H
charge: -0.072896 -0.323020 -0.389482 -0.420674 -0.412366 -0.154768 -0.020145 -0.324305 0.322475 -0.554400 0.274782 -0.301494 0.251448 0.271766 0.310280 0.280976 0.273348 0.336806 0.387346 0.264323
chargesum: 0.00000
title: Mulliken charges with hydrogens summed into heavy atoms:
elementType: Cl O N N N N N C C C C C
charge: -0.072896 -0.323020 -0.079202 -0.083868 -0.025020 -0.154768 -0.020145 0.198910 0.322475 -0.000076 0.274782 -0.037170
polarizability: 1.52324456e+02 -4.72925238e-01 9.68514827e+01 -7.96898664e+00 -5.41255317e+00 5.41695727e+01
1716.lowfreq: -0.0026 -0.0022 -0.0012 5.1109 6.6280 14.8944 24.1476 54.7800 73.7716
frequency: 24.1356 54.7750 73.7700 99.6541 127.5884 133.0973 241.1838 288.5713 305.8926 361.4488 378.0357 433.6465 496.9883 594.8051 615.9747 642.8447 696.2703 706.9384 712.7733 764.3048 801.2238 844.8723 852.7718 922.2247 961.4476 990.9195 1003.3516 1033.2879 1052.7386 1129.5616 1168.8077 1172.3133 1212.9257 1224.1082 1236.9759 1253.2300 1295.2788 1324.4256 1369.6061 1399.9334 1440.7734 1453.1358 1483.6413 1514.0877 1588.3403 1628.6482 3000.7825 3059.3220 3069.8805 3156.4368 3259.8434 3538.1117 3550.2732 3566.3224
redmass: 7.2993 8.0621 5.2990 5.1052 6.0712 5.2629 5.4339 3.2567 4.3716 5.4291 4.1411 1.7420 1.8731 3.7051 1.4035 3.5440 10.2316 4.6723 8.3796 4.4517 1.1366 1.2961 2.2154 7.7141 2.5118 2.4996 2.9598 2.7681 2.9523 2.7394 1.4453 2.0367 1.5331 3.2765 1.4753 1.5702 1.2337 3.3076 1.3543 2.7281 1.1040 1.0856 2.1828 2.3700 6.2117 5.5173 1.0604 1.0874 1.0709 1.1121 1.0991 1.0778 1.0774 1.0842
irintensity: 3.0590 3.5092 2.2139 3.3640 12.7689 6.5113 10.7092 7.1102 2.7126 4.1485 17.8271 6.5069 7.9169 32.9274 221.1117 13.0905 0.3717 7.5182 24.8915 1.5661 111.0785 61.5505 15.1889 18.0363 14.5508 15.3132 29.3969 34.5331 0.2750 3.0563 12.4820 16.4758 53.3355 32.2287 191.7460 34.6788 24.8062 51.2739 2.0472 16.3048 9.0811 32.3096 46.6485 504.4719 505.3966 256.3932 40.6403 5.7487 18.2913 13.0454 2.5459 30.4160 60.9615 116.5786
temp: 298.150 k
press: 1.00000 atm
elementType: 17 8 7 7 7 7 7 6 6 6 6 6 1 1 1 1 1 1 1 1
symmnumber: 1
zpe: 390654.3 jmol-1
zpe.correction: 0.148792 hartree
zpe.thermalcorrener: 0.160245 hartree
zpe.thermalcorrenthalpy: 0.161189 hartree
zpe.thermalcorrgfe: 0.108914 hartree
zpe.sumelectzpe: -1003.479576 hartree
zpe.sumelectthermal: -1003.468123 hartree
zpe.sumelectthermalent: -1003.467179 hartree
zpe.sumelectthermalfe: -1003.519454 hartree
dipole: -4.4454 0.1156 0.6173
dipole: 4.4896
quadrupole: -90.6121 -79.3141 -77.1117
quadrupole: -8.2707 0.3106 -1.2418
quadrupole: -8.2661 3.0318 5.2343 -8.2707 0.3106 -1.2418
hfenergy: -1003.628368 hartree
pointgroup: C01 [X(C5H8Cl1N5O1)]
dipole: 1.7569386 0.1328369 0.1243326 debye
dipolederiv: -0.3610258 -0.0519659 0.1150935 -0.1432736 -0.3427279 0.161993 0.178356 0.0924953 -0.3317885 -0.8578219 -0.0868995 0.0489799 -0.0214868 -0.7446468 0.2837636 -0.0264333 0.2589717 -0.5810584 -1.7553023 -0.0307432 0.0127785 -0.142163 -0.4132893 -0.1126937 0.0762333 -0.1055697 -0.4514819 -1.8254104 0.1299794 -0.2221369 0.428256 -0.4166511 0.1015005 -0.4991455 0.0740977 -0.4356769 -0.239466 0.1748807 -0.1302648 -0.0055466 -0.3393149 0.0977845 0.0006641 0.1218087 -0.2947919 -0.8007895 -0.0882626 0.0045113 0.1381624 -0.3828467 0.1086756 -0.1711563 0.0835355 -0.3316728 -0.3240093 -0.1309441 0.0881373 -0.0785232 -0.2800847 0.0611579 0.0381924 0.0547951 -0.2145709 0.5249185 -0.1062355 0.1490408 -0.463537 0.0896724 0.1262239 0.4018525 0.0954047 0.1647348 2.626565 0.0419086 0.142487 -0.217283 0.9348327 -0.4994117 0.4247359 -0.4498628 0.6893929 0.3079592 0.1880947 -0.1726429 0.275846 0.4185299 -0.222549 -0.2720935 -0.2456021 0.3528868 1.4791598 0.0226149 0.1213155 0.1306807 0.3465067 -0.1243673 0.0734818 -0.1312483 0.2713716 0.4522435 0.0938733 0.0056881 0.0299386 0.171037 -0.1942797 0.0508377 -0.1896779 0.0391423 -0.0959139 -0.0118658 -0.0885137 0.011792 0.01891 -0.1289038 -0.1252276 -0.0671645 0.0091639 0.1526715 -0.0639711 0.0744907 0.073801 0.0601746 0.0192561 0.0115344 0.0493883 0.0871929 0.221253 -0.0222764 -0.0394214 0.0420199 0.2136204 0.1163431 -0.1244068 0.1289799 0.2551784 0.0573662 -0.1032272 -0.0244741 -0.0869934 -0.0266073 -0.0197592 0.0169778 -0.0214276 -0.0312815 -0.0991178 0.0386408 -0.0222333 0.0380545 0.0085423 0.0752807 -0.0116435 0.0987672 0.0306624 0.139821 -0.0094319 -0.0229977 -0.0256072 0.2408115 0.0784696 -0.010556 0.0790972 0.287412 0.3972224 -0.0017267 -0.0035425 -0.008907 0.3132037 0.0305232 0.0102381 0.0328165 0.3378997 -0.0003232 0.0175576 -0.0362954 0.0247697 0.1303275 0.0409926 -0.0424414 0.040395 0.1472851 unknown
polarizability: 152.7300579|4.043049|80.587386|2.140837|-21.6420196|70.0280675 unknown
InChI: InChI=1S/C5H8ClN5O/c6-1-2-7-5(12)10-4-8-3-9-11-4/h3,7,10-11H,1-2H2
charge 0 multiplicity 1
20 atoms
Cl 4.766912 0.653178 -1.099866
O  0.265819 -0.989452 1.13861
N  1.889161 0.463682 0.277339
N  -0.380131 0.787248 -0.241854
N  -2.324651 -0.540929 0.480098
N  -2.687934 1.221085 -0.859811
N  -3.714655 -0.527658 0.286231
C  3.010054 -0.23761 0.909261
C  0.585384 0.024526 0.43588
C  4.008604 -0.783822 -0.110556
C  -1.744277 0.497909 -0.206241
C  -3.865503 0.555533 -0.525753
H  3.529901 0.429477 1.622397
H  2.578952 -1.080824 1.480743
H  2.117538 1.255947 -0.327045
H  3.535914 -1.433207 -0.8610
H  4.861022 -1.282494 0.373286
H  -0.13408 1.605551 -0.802449
H  -1.841655 -1.2350 1.053488
H  -4.843676 0.86556 -0.88176
