program: Gaussian 09
title: 000025906
version: EM64L-G09RevD.01
frameworkgroup: C1[X(C20H12O2S)]
method: RPBEPBE
basis: SDD
operation: Freq
keyword: #p
keyword: freq=noraman
keyword: PBEPBE/SDD
title: #p freq=noraman PBEPBE/SDD
converged: YES YES NO NO
title: Mulliken charges:
elementType: S O O C C C C C C C C C C C C C C C C C C C C H H H H H H H H H H H H
charge: 0.248411 -0.192579 -0.200280 0.230078 0.289503 0.267888 0.269014 -0.225799 -0.212693 -0.261308 -0.374430 -0.231342 -0.374428 -0.372917 -0.241544 -0.228463 -0.225953 -0.216326 -0.224449 -0.230231 -0.209135 -0.207619 -0.219658 0.310979 0.290968 0.289913 0.290984 0.252440 0.239998 0.240097 0.262285 0.261187 0.235472 0.235308 0.234631
chargesum: 0.00000
title: Mulliken charges with hydrogens summed into heavy atoms:
elementType: S O O C C C C C C C C C C C C C C C C C C C C
charge: 0.248411 -0.192579 -0.200280 0.230078 0.289503 0.267888 0.269014 -0.225799 -0.212693 0.049671 -0.083462 -0.231342 -0.084516 -0.081933 0.010895 0.011535 0.014143 -0.216326 0.037836 0.030956 0.026337 0.027689 0.014973
polarizability: 3.76089337e+02 -5.62743937e+00 2.71155584e+02 -3.23992528e+00 4.88697202e-01 1.28122998e+02
1716.lowfreq: -5.0820 0.0018 0.0021 0.0024 5.6420 7.7833 14.3639 23.2926 39.1366
frequency: 14.0151 23.1534 39.1253 41.2778 83.9000 122.9396 123.9019 147.6888 190.3022 194.4484 262.6922 264.1090 275.1893 295.8798 325.1428 371.3368 397.9462 403.5800 404.5066 425.8400 439.6803 443.6850 455.9644 491.8533 512.4130 528.2173 609.9924 627.8945 638.3615 658.7810 677.0198 680.8077 687.2566 695.6351 725.2814 728.2025 756.7302 797.5784 805.2571 848.1543 850.5708 879.2311 915.3272 928.8062 931.7171 946.0740 962.2093 979.7375 985.1739 995.9184 999.5593 1001.1356 1014.7521 1015.7075 1033.5681 1057.9177 1072.6681 1076.3056 1085.7071 1107.4663 1165.8108 1169.5561 1174.2257 1180.2552 1183.0866 1225.8424 1260.7412 1286.5786 1301.4275 1307.2079 1374.5115 1375.4143 1396.3267 1418.5104 1426.8387 1441.1796 1459.4808 1465.7677 1469.6273 1527.3156 1544.6592 1559.9362 1586.7827 1588.5038 1592.8474 1597.9272 1615.6482 3133.3210 3136.2570 3139.0128 3142.8357 3151.2474 3154.1460 3159.4943 3162.2862 3163.0552 3164.8073 3171.6174 3173.6285
redmass: 6.0094 4.1358 6.2345 7.8544 6.6319 4.9212 6.8342 6.2667 5.9331 5.4168 6.0192 5.6229 6.3830 9.6488 6.6039 10.6467 8.2136 2.8905 3.2742 7.4182 4.8578 3.3488 11.3448 6.1789 5.1656 4.5182 6.4834 7.0837 6.9414 4.0170 6.7491 7.0183 7.6120 2.1757 3.1045 3.0210 1.5408 7.0043 1.6573 1.6631 1.2459 1.8761 6.9652 1.3916 1.5121 6.3709 1.9586 1.3944 6.3485 1.3837 1.4043 1.3298 3.3862 1.3772 2.0446 2.2606 1.5922 2.5106 2.4680 2.3367 1.5655 1.4576 1.0543 1.8208 1.1326 1.6201 1.4078 2.3002 1.3142 3.5699 8.8152 7.3488 8.9535 5.1981 2.0783 2.6823 2.1041 2.7211 2.7219 10.4627 9.3734 7.7231 6.0854 6.3348 6.6238 8.0878 7.3194 1.0852 1.0862 1.0891 1.0886 1.0902 1.0930 1.0909 1.0946 1.0970 1.0959 1.1003 1.1017
irintensity: 0.2576 0.0052 0.6460 2.6556 4.3657 0.2686 0.5479 0.4062 0.2093 1.4499 0.3953 0.4026 0.0345 0.7732 0.7715 20.5959 9.6055 0.3350 1.1675 0.8928 1.0567 0.2774 3.3984 22.8004 1.6034 6.8220 0.1254 10.9054 6.5834 6.2776 5.2937 0.3177 10.4744 45.7559 39.5904 38.3293 63.5897 20.4521 15.6826 27.9920 0.5330 12.5207 53.5292 6.8517 3.7794 12.9007 1.3420 0.0037 12.2739 0.0247 6.4804 0.1922 17.6737 0.0648 5.7964 21.1135 7.7647 0.5580 10.2362 3.5766 3.6840 30.5268 0.0010 16.8060 4.0589 5.7201 25.7215 198.2052 0.9604 643.2562 2.8408 4.6686 0.0702 0.8849 11.1552 1.3453 30.7099 3.5052 13.7970 86.1721 340.7677 43.4085 23.8219 1.6326 36.7535 27.8066 19.4546 0.2671 3.9708 3.3545 4.4585 6.0663 13.4894 2.6358 1.2925 17.8092 8.1810 31.8896 16.0570
temp: 298.150 k
press: 1.00000 atm
elementType: 16 8 8 6 6 6 6 6 6 6 6 6 6 6 6 6 6 6 6 6 6 6 6 1 1 1 1 1 1 1 1 1 1 1 1
symmnumber: 1
zpe: 673515.6 jmol-1
zpe.correction: 0.256529 hartree
zpe.thermalcorrener: 0.274610 hartree
zpe.thermalcorrenthalpy: 0.275554 hartree
zpe.thermalcorrgfe: 0.207606 hartree
zpe.sumelectzpe: -1316.316324 hartree
zpe.sumelectthermal: -1316.298243 hartree
zpe.sumelectthermalent: -1316.297299 hartree
zpe.sumelectthermalfe: -1316.365247 hartree
dipole: 1.1339 -2.3118 0.0487
dipole: 2.5754
quadrupole: -120.9020 -134.7710 -135.6881
quadrupole: 5.5109 -0.1816 -0.2963
quadrupole: 9.5517 -4.3173 -5.2344 5.5109 -0.1816 -0.2963
hfenergy: -1316.5728526 hartree
pointgroup: C01 [X(C20H12O2S1)]
dipole: 0.4277638 0.901708 -0.1749404 debye
polarizability: 375.8573211|7.2894342|267.8473023|-3.0568793|-22.3356588|131.6632957 unknown
InChI: InChI=1S/C20H12O2S/c21-19-15-8-4-5-9-16(15)20(22)18-12-14(10-11-17(18)19)23-13-6-2-1-3-7-13/h1-12H
charge 0 multiplicity 1
35 atoms
S  3.426022 -1.949895 0.200954
O  -0.418918 1.956051 -0.33803
O  -3.416848 -2.631867 0.363636
C  -0.456031 -0.434976 0.013173
C  -1.235056 -1.61603 0.194628
C  -2.604299 0.943272 -0.166627
C  -3.377527 -0.241503 0.014856
C  -1.109155 0.900027 -0.17587
C  -2.722694 -1.57525 0.202997
C  0.956362 -0.503014 0.009277
C  -0.570111 -2.857069 0.370725
C  1.602738 -1.743909 0.184104
C  -3.257921 2.188245 -0.341905
C  -4.791582 -0.161764 0.018365
C  0.831663 -2.927199 0.365986
C  -4.665187 2.258672 -0.336959
C  -5.433964 1.080515 -0.156204
C  4.032948 -0.23704 -0.131526
C  4.198631 0.198768 -1.466149
C  4.3893 0.596929 0.952489
C  4.718181 1.489998 -1.7156
C  4.911812 1.885933 0.694869
C  5.074991 2.332891 -0.636952
H  1.515835 0.426918 -0.131696
H  -1.179442 -3.755756 0.508656
H  -2.639783 3.081056 -0.479251
H  -5.359064 -1.087018 0.159666
H  1.333796 -3.891482 0.500785
H  -5.166097 3.223097 -0.47273
H  -6.527768 1.136711 -0.152486
H  3.923804 -0.46206 -2.294384
H  4.257502 0.242829 1.979781
H  4.843049 1.833385 -2.748047
H  5.186105 2.536268 1.532316
H  5.477106 3.332767 -0.833447
