program: Gaussian 09
title: 000276066
version: EM64L-G09RevD.01
frameworkgroup: C1[X(C12H19NO4)]
method: RPBEPBE
basis: SDD
operation: Freq
keyword: #p
keyword: freq=noraman
keyword: PBEPBE/SDD
title: #p freq=noraman PBEPBE/SDD
converged: NO YES NO NO
title: Mulliken charges:
elementType: O O O O N C C C C C C C C C C C C H H H H H H H H H H H H H H H H H H H
charge: -0.447926 -0.462729 -0.214111 -0.217755 -0.357685 -0.102091 -0.117353 -0.228029 -0.486798 -0.452441 -0.432348 -0.462022 -0.062610 -0.526205 -0.529795 0.147324 0.154894 0.223279 0.193760 0.278610 0.227676 0.215113 0.240752 0.220656 0.224999 0.202255 0.201612 0.240364 0.256302 0.251314 0.262682 0.252604 0.250962 0.371943 0.333582 0.349214
chargesum: 0.00000
title: Mulliken charges with hydrogens summed into heavy atoms:
elementType: O O O O N C C C C C C C C C C C C
charge: -0.075983 -0.129147 -0.214111 -0.217755 -0.008471 0.121188 0.076407 0.050582 -0.044009 0.008967 -0.005093 -0.020046 0.193692 -0.012209 -0.026229 0.147324 0.154894
polarizability: 1.52107934e+02 -2.31991555e+00 1.36494277e+02 -1.22513560e+01 4.68505859e+00 1.36260791e+02
1716.lowfreq: -14.8624 -6.6025 -2.8246 -0.0005 -0.0005 -0.0003 20.2396 34.0039 47.1460
frequency: 16.5088 33.5201 47.0790 55.0660 87.5380 112.9155 131.6109 152.6489 188.8020 215.4190 238.6708 303.0008 319.6116 335.3310 354.6969 386.3906 401.0123 421.3656 443.5165 476.8145 505.8617 515.3436 527.2929 547.5735 580.1296 594.7095 640.2937 671.7369 681.5129 779.6008 793.8752 811.9754 839.3997 844.0408 869.2617 871.9631 895.5300 907.0665 913.6570 930.5144 941.9331 981.2086 998.3224 1016.5374 1047.3119 1054.3268 1074.3935 1082.8499 1102.5211 1118.2840 1134.8229 1144.8373 1157.1156 1171.8010 1207.9088 1217.7003 1222.4408 1251.2597 1253.0624 1269.7977 1280.0189 1286.3632 1293.2205 1302.1114 1309.0019 1312.3234 1321.9994 1328.4090 1338.7743 1342.1223 1360.3248 1366.0076 1369.2667 1371.4887 1384.9991 1438.4278 1450.4000 1455.1641 1463.5635 1470.1235 1479.9185 1639.2376 1643.1414 2935.5640 2960.2097 2962.8918 2984.1823 2984.6465 2989.1453 2989.4897 3013.4613 3016.5419 3033.8026 3055.9419 3062.9416 3065.2847 3073.8070 3083.6682 3084.4385 3441.8768 3480.5050 3543.1440
redmass: 4.8656 5.9440 4.3333 3.7942 5.1167 5.5894 3.2839 5.7219 2.6954 2.8955 3.7491 2.3844 2.5516 2.4652 2.8830 1.9011 2.9557 3.0012 3.3037 3.6370 4.4190 4.6789 2.6027 2.2061 3.4875 3.2555 1.7567 2.8962 1.4832 3.3303 1.6661 1.9880 1.9483 2.6628 2.4903 2.6848 2.2516 2.1137 2.1490 2.0527 2.6403 2.1023 3.1689 1.4845 2.2960 2.3570 2.0656 2.0529 2.6301 1.6248 1.5214 1.3344 1.3823 1.4429 1.3997 1.4423 1.3722 1.8638 1.1359 1.7197 1.6826 1.2517 1.4205 1.3777 1.5185 1.7723 1.6918 1.4977 1.3721 1.4807 1.4429 1.2450 1.4498 1.8317 1.4912 1.0818 1.0803 1.0868 1.0878 1.0805 1.1002 11.4553 5.4102 1.0829 1.0686 1.0807 1.0632 1.0662 1.0640 1.0679 1.0625 1.0899 1.0903 1.0979 1.0960 1.0935 1.0944 1.0933 1.1035 1.0651 1.0760 1.0658
irintensity: 1.9622 0.4300 3.2771 0.4936 8.6867 2.6351 2.1389 5.4252 3.7427 1.8427 0.8145 2.8077 1.3391 9.6940 27.2376 72.9512 9.6961 10.6871 23.5415 1.0693 2.7940 11.9726 3.5873 5.8731 26.6501 11.7102 73.2392 48.2739 142.2836 6.1304 58.0851 72.2547 1.9245 5.2781 7.5111 9.4515 42.3638 2.5406 8.3540 3.8004 7.8118 23.3115 30.0284 6.8202 6.4173 18.3467 6.8715 13.5509 17.9642 21.7815 8.2439 109.7731 16.1622 0.6212 23.6391 24.8889 2.5373 45.1438 31.7317 46.5506 96.0912 0.1415 0.3416 31.5939 7.5009 41.4668 14.6571 11.4333 19.9764 14.4919 16.8908 26.6812 6.8453 18.3825 21.4780 11.0446 18.9637 6.0865 10.9653 9.5882 7.0145 113.6774 448.2081 10.4740 9.8431 86.7044 32.0782 10.5052 48.6829 3.4404 24.1353 4.9480 25.7818 30.2988 17.1998 37.0073 14.7987 13.2639 47.7839 54.5112 35.1299 5.2176
temp: 298.150 k
press: 1.00000 atm
elementType: 8 8 8 8 7 6 6 6 6 6 6 6 6 6 6 6 6 1 1 1 1 1 1 1 1 1 1 1 1 1 1 1 1 1 1 1
symmnumber: 1
zpe: 793478.5 jmol-1
zpe.correction: 0.302220 hartree
zpe.thermalcorrener: 0.318801 hartree
zpe.thermalcorrenthalpy: 0.319745 hartree
zpe.thermalcorrgfe: 0.256157 hartree
zpe.sumelectzpe: -823.015810 hartree
zpe.sumelectthermal: -822.999229 hartree
zpe.sumelectthermalent: -822.998285 hartree
zpe.sumelectthermalfe: -823.061873 hartree
dipole: -0.7302 -2.6889 -2.6542
dipole: 3.8481
quadrupole: -116.8467 -99.5627 -113.6937
quadrupole: -9.1734 16.2321 -0.3873
quadrupole: -6.8124 10.4717 -3.6594 -9.1734 16.2321 -0.3873
hfenergy: -823.3180296 hartree
pointgroup: C01 [X(C12H19N1O4)]
dipole: 0.2602647 0.2818 -1.4645693 debye
polarizability: 152.4890944|5.0408386|132.0732298|11.2056705|-1.8537888|140.3006786 unknown
InChI: InChI=1S/C12H19NO4/c14-9-3-1-2-8(9)10(15)4-7-5-11(16)13-12(17)6-7/h7-10,13-15H,1-6H2
charge 0 multiplicity 1
36 atoms
O  3.579434 1.530417 0.37157
O  1.332927 1.955272 -1.231563
O  -2.228435 -0.272227 2.768972
O  -4.112934 -1.438432 -1.298494
N  -3.151242 -0.78266 0.705866
C  2.215368 -0.324643 -0.722162
C  3.637055 0.305358 -0.438978
C  1.065633 0.675988 -0.49938
C  2.141016 -1.579635 0.194844
C  4.425553 -0.758769 0.367436
C  3.608511 -2.070854 0.258371
C  -0.317551 0.124114 -0.892072
C  -1.4884 1.102525 -0.606307
C  -1.766872 1.276596 0.908511
C  -2.794914 0.643617 -1.300619
C  -2.370841 0.036089 1.557235
C  -3.406789 -0.604565 -0.67372
H  2.18983 -0.66124 -1.782473
H  4.132358 0.533944 -1.406314
H  1.075674 0.999212 0.554909
H  1.446198 -2.351357 -0.18162
H  1.801335 -1.283218 1.207658
H  4.454818 -0.407901 1.415358
H  5.467438 -0.866123 0.02064
H  3.793463 -2.757671 1.102915
H  3.862984 -2.614265 -0.673025
H  -0.307325 -0.118922 -1.976033
H  -0.482401 -0.83505 -0.362334
H  -1.201205 2.08897 -1.016018
H  -2.481204 2.110682 1.063731
H  -0.860871 1.537509 1.479388
H  -2.64315 0.428686 -2.372151
H  -3.5565 1.447971 -1.241657
H  3.019107 2.182339 -0.135746
H  1.40734 1.750593 -2.199424
H  -3.572114 -1.614247 1.140282
