program: Gaussian 09
title: 000276064
version: EM64L-G09RevD.01
frameworkgroup: C1[X(C9H9Cl2N3O3)]
method: RPBEPBE
basis: SDD
operation: Freq
keyword: #p
keyword: freq=noraman
keyword: PBEPBE/SDD
title: #p freq=noraman PBEPBE/SDD
converged: YES YES NO NO
title: Mulliken charges:
elementType: Cl Cl O O O N N N C C C C C C C C C H H H H H H H H H
charge: -0.027832 -0.054686 -0.421322 -0.321562 -0.210394 -0.186793 -0.479341 0.047853 0.428363 -0.324490 0.343297 0.111480 -0.380870 -0.571399 -0.287942 -0.099466 -0.219899 0.274297 0.280145 0.360984 0.256922 0.279312 0.294521 0.262884 0.260984 0.384955
chargesum: 0.00000
title: Mulliken charges with hydrogens summed into heavy atoms:
elementType: Cl Cl O O O N N N C C C C C C C C C
charge: -0.027832 -0.054686 -0.036367 -0.321562 -0.210394 -0.186793 -0.118357 0.047853 0.428363 0.229952 0.343297 0.111480 -0.123948 0.002433 -0.025058 -0.099466 0.041085
polarizability: 2.70929776e+02 5.42958297e+00 1.67196017e+02 8.29335848e+00 -2.73545587e+00 6.93117883e+01
1716.lowfreq: -6.0055 -0.0031 -0.0029 -0.0024 2.6398 4.4684 15.7431 24.1572 45.5664
frequency: 15.6210 24.0757 45.5339 54.8008 81.8873 99.4512 118.2901 134.4395 179.8620 208.2610 226.6978 248.3354 270.0813 311.4009 331.0600 348.5261 365.0099 375.3440 441.4078 459.0826 490.5481 500.3884 555.3777 621.1582 634.8372 670.0096 698.2885 703.0745 743.1632 754.3443 790.1020 792.2499 813.5277 843.7707 858.8195 863.6653 886.8259 929.5603 945.7061 1037.8616 1051.9886 1082.5905 1090.7946 1122.3976 1202.4744 1226.9596 1236.5540 1243.3711 1265.4974 1277.7907 1326.5649 1357.1265 1362.5614 1389.3614 1393.6899 1437.8846 1442.4525 1455.8221 1479.6498 1538.9820 1581.8930 1598.1178 1644.2763 2974.9289 3046.7199 3070.1883 3121.5179 3144.8093 3159.2897 3166.5457 3185.9957 3418.0949
redmass: 9.7713 7.3873 8.8228 3.0699 6.1409 10.7168 10.0380 7.8349 9.6439 6.6741 8.0794 6.6483 7.4466 8.6611 6.1563 3.8053 10.1975 6.5184 7.8797 3.4887 7.0718 7.0937 4.3680 8.1219 7.8839 6.5494 3.8616 6.2125 2.0553 3.9438 1.2904 2.4734 1.4277 3.0601 1.4848 1.5126 3.0317 3.1532 1.3328 2.0181 2.7527 3.1717 2.3200 1.6003 1.7957 1.9527 2.4058 1.8629 1.1750 2.0309 1.2610 1.7375 1.8113 6.9580 6.0481 1.4979 1.2596 1.0944 3.0519 2.2932 4.2959 6.9273 5.3991 1.0741 1.0595 1.0558 1.1047 1.0926 1.1128 1.0885 1.0978 1.0759
irintensity: 0.0694 0.0384 0.1928 1.9357 0.8349 0.8816 2.3438 6.5397 5.7770 1.8205 1.4763 2.6419 13.0470 0.6555 0.2796 8.7489 3.9615 41.8079 7.9152 9.4593 19.1937 3.6145 3.8587 36.0965 24.3785 5.6456 8.5985 59.1038 4.6774 19.5985 62.7148 122.4232 66.6542 11.0294 29.3874 121.5061 63.4820 114.3258 0.3515 49.9984 7.7651 23.1173 5.1147 34.7090 2.1793 9.1729 31.6403 96.3561 12.2993 21.3946 40.5382 45.3168 23.9793 212.6390 98.3570 94.2273 17.4636 10.3548 147.5021 233.2243 108.4397 75.1017 108.0343 457.9399 1.1747 12.3818 1.7367 1.7684 2.2010 0.6666 2.2469 46.7474
temp: 298.150 k
press: 1.00000 atm
elementType: 17 17 8 8 8 7 7 7 6 6 6 6 6 6 6 6 6 1 1 1 1 1 1 1 1 1
symmnumber: 1
zpe: 469949.0 jmol-1
zpe.correction: 0.178994 hartree
zpe.thermalcorrener: 0.195491 hartree
zpe.thermalcorrenthalpy: 0.196435 hartree
zpe.thermalcorrgfe: 0.131319 hartree
zpe.sumelectzpe: -1657.108769 hartree
zpe.sumelectthermal: -1657.092272 hartree
zpe.sumelectthermalent: -1657.091328 hartree
zpe.sumelectthermalfe: -1657.156444 hartree
dipole: -0.0425 0.8366 -0.0612
dipole: 0.8399
quadrupole: -127.4627 -123.0481 -112.4791
quadrupole: 4.3596 0.0083 1.5181
quadrupole: -6.4661 -2.0514 8.5175 4.3596 0.0083 1.5181
hfenergy: -1657.2877631 hartree
pointgroup: C01 [X(C9H9Cl2N3O3)]
dipole: 0.0527876 -0.0029248 0.3261718 debye
dipolederiv: -0.5520517 0.0069708 0.2214772 0.0428561 -0.179315 -0.0176697 0.2274372 0.0021809 -0.26521 -0.4497883 -0.0213463 0.291523 -0.0404563 -0.0673859 0.0485654 0.4632831 0.0399186 -0.5197392 -0.690858 -0.1282772 0.5097802 -0.0641573 -0.4021115 0.1275723 0.2629696 0.0595946 -0.941473 -0.7976176 0.0029454 -0.1144071 0.2440777 -0.3956605 -0.0764033 0.4169317 -0.1715011 -0.9533451 -1.0251433 -0.0441002 -0.8635425 0.0299453 -0.1607424 0.0130864 -0.4080977 -0.0379195 -0.6738241 -0.7149765 -0.0220965 -0.0720195 -0.3091276 -0.1566902 -0.0730218 -0.834029 -0.0542564 -1.058885 -1.2671997 0.0711295 0.1900595 0.2448394 -0.291304 -0.0407814 0.4166574 -0.0439659 -0.3707344 0.3342765 0.0436406 0.7172559 0.1006996 -0.0096822 0.1355616 0.7911706 0.1506527 1.3232634 0.4681513 0.0242929 -0.0631574 -0.0689379 0.0372521 0.0309435 0.2885983 -0.0174383 -0.1291593 0.2932536 -0.0073568 -0.0934755 0.0591636 0.1530401 -0.0048334 -0.157596 -0.0141888 0.041882 2.0562998 -0.0798774 0.1879215 -0.2222984 0.3464712 0.1608142 -0.3330791 0.2527837 1.2293095 0.2415169 0.1347284 -0.5810999 0.0815171 0.0804614 -0.0889813 -0.3222433 -0.1187777 0.7794892 0.0400297 -0.0279118 0.1193099 -0.0454421 -0.1214822 0.0003069 -0.0549667 0.0072712 -0.1590856 0.6895527 -0.0280589 -0.2788809 0.0076753 0.1470554 -0.0208128 -0.294783 0.0292868 0.3215703 0.0833153 -0.0647168 0.2732012 -0.0169048 -0.1470959 -0.0594491 0.009248 -0.0231327 0.0080468 0.2558319 0.0562853 -0.5183282 0.1240361 -0.0812547 -0.0884946 -0.9141282 -0.0489043 0.672567 -0.1329548 -0.0052166 0.0761717 -0.0529572 -0.099464 -0.0107748 0.4411587 -0.0369589 -0.0433693 0.0316696 0.0345518 0.010857 -0.0237606 0.0853726 0.0204842 -0.0742311 0.069208 0.0353884 0.1057946 -0.0517514 0.0158595 -0.0732717 0.0484911 -0.029105 0.0374668 -0.061306 0.0627196 0.3326231 0.011809 0.0264372 0.0266516 0.2901359 -0.0047967 0.0433768 -0.0079229 0.182146 0.0659059 0.0111488 -0.0747228 0.0141372 0.1668415 0.0255888 -0.0646478 0.0271373 0.0054426 0.0033422 -0.002266 0.046477 -0.0072622 0.0006472 -0.0427733 0.0132652 -0.1049112 -0.0115087 -0.0353033 0.0714348 -0.0304905 0.0532356 0.056252 0.0217433 -0.000154 0.0426844 0.0135656 0.0642755 0.0059651 -0.0145836 0.0144502 0.1625901 0.0246853 -0.0445542 0.0272096 -0.0223181 -0.0380861 0.0121042 -0.0167166 0.0104325 0.1671979 0.0101069 -0.002549 0.0084455 0.1099882 0.6381406 -0.004031 0.0350938 -0.129141 0.3703799 -0.0615615 0.0934956 0.0248102 0.3632732 unknown
polarizability: 268.3285989|-9.4044998|69.5013042|-16.9698355|-3.3755531|169.6076785 unknown
InChI: InChI=1S/C9H9Cl2N3O3/c10-3-4-14(13-17)9(16)12-7-5-6(11)1-2-8(7)15/h1-2,5,12,15H,3-4H2
charge 0 multiplicity 1
26 atoms
Cl 5.704242 0.169471 -1.787712
Cl -4.84344 -0.11608 2.588299
O  -1.306919 0.426777 -2.269798
O  0.987722 -0.494384 -1.515787
O  3.331838 -0.015293 2.407422
N  2.249115 -0.281122 0.436657
N  -0.092656 0.005652 0.530151
N  2.20513 -0.003947 1.821923
C  -1.491022 0.05034 0.203282
C  3.503419 -0.598391 -0.284782
C  0.987435 -0.264796 -0.261147
C  -2.035663 0.248233 -1.109555
C  -2.366973 -0.061553 1.317088
C  4.105197 0.662005 -0.930104
C  -3.447712 0.322311 -1.244343
C  -3.75247 0.028189 1.136537
C  -4.313716 0.222037 -0.142493
H  4.204613 -1.019987 0.455228
H  3.271765 -1.345733 -1.058748
H  0.143147 0.138889 1.524036
H  -1.956317 -0.222097 2.319937
H  4.379833 1.425171 -0.188016
H  3.453698 1.074863 -1.712798
H  -3.840268 0.475097 -2.253432
H  -5.396651 0.291769 -0.274058
H  -0.35525 0.068677 -2.178785
