program: Gaussian 09
title: 000270478
version: EM64L-G09RevD.01
frameworkgroup: C1[X(C10H15N3O5)]
method: RPBEPBE
basis: SDD
operation: Freq
keyword: #p
keyword: freq=noraman
keyword: PBEPBE/SDD
title: #p freq=noraman PBEPBE/SDD
converged: YES YES NO NO
title: Mulliken charges:
elementType: O O O O O N N N C C C C C C C C C C H H H H H H H H H H H H H H H
charge: -0.238919 -0.420355 -0.475277 -0.426759 -0.281923 -0.193167 -0.204602 -0.351289 -0.157681 -0.165428 -0.156472 -0.060618 -0.391667 0.277637 -0.112649 -0.334288 0.130230 -0.606593 0.275692 0.284249 0.308241 0.242018 0.228281 0.216807 0.352431 0.360227 0.326838 0.230188 0.345660 0.261755 0.253720 0.252444 0.231269
chargesum: 0.00000
title: Mulliken charges with hydrogens summed into heavy atoms:
elementType: O O O O O N N N C C C C C C C C C C
charge: -0.238919 -0.067925 -0.115051 -0.081099 -0.281923 -0.193167 -0.204602 -0.120020 0.118011 0.118821 0.151769 0.181400 0.053421 0.277637 0.214189 -0.104099 0.130230 0.161326
polarizability: 1.95502849e+02 -1.79090941e+01 1.48890872e+02 6.20694866e+00 6.39595089e+00 9.96680600e+01
1716.lowfreq: -3.9979 -0.0008 -0.0007 0.0006 8.4304 10.8493 29.5907 43.4098 64.3295
frequency: 29.5283 43.3859 64.3244 90.5485 96.5339 108.1570 131.0350 139.9529 149.7083 195.8171 207.7398 243.2966 257.7318 277.5521 299.5464 343.3140 356.5651 360.0425 366.4152 382.2266 405.1538 424.9864 435.9642 486.4826 501.1638 528.1218 557.6916 596.5787 638.1438 669.8283 700.7529 729.0807 753.8255 760.8164 800.6076 816.6444 850.1770 876.6086 910.3253 938.3442 950.6181 965.7970 987.2779 990.5173 994.9542 1008.3654 1041.0367 1045.3319 1062.7063 1103.9774 1129.8528 1130.1544 1136.9820 1173.7555 1180.6054 1201.9901 1211.3148 1220.5694 1254.7275 1264.5241 1289.7777 1295.3244 1305.0321 1319.7941 1341.5963 1357.4225 1369.4174 1369.8818 1393.3797 1414.4007 1422.4207 1450.3158 1465.8168 1476.1581 1477.8044 1557.9223 1624.2941 1662.8624 2978.9112 2996.1055 3016.8600 3034.0729 3087.8342 3089.2612 3094.7764 3104.5135 3121.2126 3151.2311 3185.5716 3370.5477 3537.4494 3564.1577 3584.8223
redmass: 5.4770 5.4892 5.4974 3.7514 4.8655 2.6786 2.4915 1.8381 4.4111 4.8804 6.6411 3.6574 4.7794 3.9599 1.3621 1.3625 3.0033 1.3645 2.1041 4.0009 5.5313 4.1191 3.9878 5.5413 6.8149 5.5234 5.6728 4.7418 5.7457 3.5861 6.5848 8.3495 4.0181 1.5405 6.3576 1.3261 2.2782 5.0230 3.5234 3.2899 3.3287 4.1353 2.0151 2.9956 2.2206 3.9954 2.2260 2.0196 1.8613 1.7282 1.5483 1.3258 1.2877 2.9818 2.4358 1.8354 1.3897 1.3147 1.2535 1.3378 1.7382 2.5426 1.4697 1.3801 1.2876 1.2121 2.1963 1.2785 1.4843 1.3315 1.2982 2.2149 1.0427 1.0864 1.0957 5.3347 9.1064 6.1265 1.0848 1.0648 1.0332 1.0868 1.0921 1.0967 1.0864 1.1012 1.0967 1.1026 1.0957 1.0762 1.0661 1.0663 1.0665
irintensity: 0.6060 0.1047 0.6206 0.2513 4.2048 5.5358 2.7524 4.0029 5.7496 3.9202 3.9743 0.7385 9.6583 52.7944 190.6140 44.3382 8.5555 150.6346 44.9623 42.7610 20.1190 13.8262 11.8588 9.5414 11.4003 11.4401 1.8234 38.2011 10.2963 2.4752 4.4980 9.7192 33.4289 8.6440 36.5721 123.6426 20.2146 35.5267 13.4445 48.1331 37.1768 216.8519 15.3947 10.2921 70.3790 206.5503 65.7995 26.3402 75.3076 7.1797 26.2815 2.0464 17.5012 25.2333 70.4699 131.1801 9.9786 12.9189 12.7721 16.7579 76.4011 35.7718 50.2421 15.3297 20.9672 10.7211 64.1083 21.2013 0.1452 24.7063 40.9292 115.6368 16.5094 6.7500 2.4836 188.4119 205.9699 361.9596 22.8014 41.2767 19.6373 15.5160 14.4819 23.3922 15.9591 14.5512 73.9669 1.6795 1.6199 14.8206 12.6876 11.3993 15.2071
temp: 298.150 k
press: 1.00000 atm
elementType: 8 8 8 8 8 7 7 7 6 6 6 6 6 6 6 6 6 6 1 1 1 1 1 1 1 1 1 1 1 1 1 1 1
symmnumber: 1
zpe: 676432.8 jmol-1
zpe.correction: 0.257640 hartree
zpe.thermalcorrener: 0.275475 hartree
zpe.thermalcorrenthalpy: 0.276419 hartree
zpe.thermalcorrgfe: 0.211660 hartree
zpe.sumelectzpe: -929.017361 hartree
zpe.sumelectthermal: -928.999526 hartree
zpe.sumelectthermalent: -928.998581 hartree
zpe.sumelectthermalfe: -929.063340 hartree
dipole: 3.0328 3.7291 1.1652
dipole: 4.9459
quadrupole: -120.5277 -104.1196 -104.5832
quadrupole: 0.9497 -1.2902 3.5027
quadrupole: -10.7842 5.6239 5.1603 0.9497 -1.2902 3.5027
hfenergy: -929.2750004 hartree
pointgroup: C01 [X(C10H15N3O5)]
dipole: -1.2482901 -0.8376786 1.2355075 debye
polarizability: 194.3050849|-18.6507676|124.4108415|7.7727652|-26.1082104|125.345855 unknown
InChI: InChI=1S/C10H15N3O5/c1-12-6(11)2-3-13(10(12)17)9-8(16)7(15)5(4-14)18-9/h2-3,5,7-9,11,14-16H,4H2,1H3
charge 0 multiplicity 1
33 atoms
O  -1.415975 0.105534 -1.354168
O  -2.318023 2.716586 0.115187
O  -2.39939 -0.508369 1.924674
O  -4.77254 -1.368529 -0.579595
O  1.814456 1.555143 -1.65218
N  0.614783 0.403844 0.01026
N  2.974761 0.048575 -0.279948
N  4.212874 -1.437455 1.050241
C  -1.639526 1.498956 0.568769
C  -2.655333 0.319507 0.732511
C  -0.621619 1.021006 -0.50085
C  -2.425295 -0.58357 -0.504233
C  -3.674004 -0.804723 -1.373223
C  1.818445 0.717953 -0.705279
C  0.615421 -0.513494 1.068137
C  1.760505 -1.145971 1.464827
C  3.036099 -0.901111 0.790611
C  4.240369 0.343185 -0.990071
H  -1.166491 1.78234 1.521733
H  -3.68313 0.725695 0.763452
H  -0.291475 1.837568 -1.161099
H  -2.018993 -1.554945 -0.153199
H  -3.421079 -1.443328 -2.242572
H  -4.055703 0.159462 -1.747418
H  -2.638947 2.584011 -0.814865
H  -2.780546 -0.068019 2.724377
H  -0.345385 -0.684755 1.565151
H  1.736883 -1.850152 2.299107
H  -4.51089 -2.262664 -0.242623
H  4.029306 1.085284 -1.772046
H  4.641839 -0.587002 -1.423927
H  4.98437 0.723647 -0.271495
H  4.159936 -2.110009 1.838858
