program: Gaussian 09
title: 000270472
version: EM64L-G09RevD.01
frameworkgroup: C1[X(C15H19NO6)]
method: RPBEPBE
basis: SDD
operation: Freq
keyword: #p
keyword: freq=noraman
keyword: PBEPBE/SDD
title: #p freq=noraman PBEPBE/SDD
converged: YES YES NO NO
title: Mulliken charges:
elementType: O O O O O O N C C C C C C C C C C C C C C C H H H H H H H H H H H H H H H H H H H
charge: -0.232245 -0.207243 -0.440639 -0.219667 -0.198808 -0.168152 0.022778 0.002044 -0.441573 -0.387450 -0.392323 -0.338095 -0.721493 -0.711437 0.150039 0.190616 0.124941 0.239395 -0.325642 -0.360640 -0.192550 0.121999 0.189558 0.266482 0.213719 0.192184 0.191177 0.197141 0.200619 0.238004 0.247770 0.210474 0.203809 0.256457 0.215476 0.212505 0.218069 0.292360 0.294750 0.251032 0.394558
chargesum: 0.00000
title: Mulliken charges with hydrogens summed into heavy atoms:
elementType: O O O O O O N C C C C C C C C C C C C C C C
charge: -0.232245 -0.207243 -0.046080 -0.219667 -0.198808 -0.168152 0.022778 0.191603 0.038628 -0.004089 0.005438 0.147679 -0.050753 -0.065387 0.150039 0.190616 0.124941 0.239395 -0.033282 -0.065890 0.058482 0.121999
polarizability: 2.48596118e+02 -3.10752104e+00 2.06676538e+02 -1.33815033e+01 -1.92622191e-01 1.35131032e+02
1716.lowfreq: -13.9445 -0.0006 -0.0004 -0.0001 1.3441 3.9484 8.3694 24.1095 26.4253
frequency: -8.7474 23.9804 26.2301 38.2352 50.5381 54.4057 67.8000 93.5473 118.6619 125.0947 141.5832 160.0893 169.2682 175.5284 187.2922 193.7672 236.4850 250.1808 263.7558 273.8028 291.9719 319.0207 327.2598 358.5017 380.3381 395.6294 409.8397 440.0632 451.7929 503.3925 527.4816 537.0713 567.1723 595.1715 604.8764 664.0109 676.3685 684.7915 721.5758 732.7377 750.0055 752.8587 770.1117 776.3033 805.6646 823.8977 835.1688 850.8322 897.2493 899.9942 957.5497 968.1100 991.0749 1010.8570 1017.2096 1022.9848 1030.2721 1045.9771 1054.1109 1071.8220 1097.6833 1135.7591 1143.0266 1145.2670 1172.7905 1174.1692 1203.6573 1207.9845 1230.6914 1235.6188 1244.0994 1249.0517 1275.2189 1298.1723 1312.2931 1319.1489 1336.0540 1345.0967 1351.9712 1373.4725 1381.6649 1387.8727 1389.1184 1398.0338 1423.4877 1459.8802 1462.4404 1469.2713 1472.7710 1476.9131 1478.4707 1484.4753 1489.1111 1504.4076 1573.9827 1602.3715 1619.9673 1650.2976 2942.7323 2958.8896 2966.4786 2972.0704 2974.0924 3004.9476 3013.5933 3019.0758 3036.7522 3064.1045 3067.7098 3070.3033 3073.9913 3077.4068 3114.7717 3162.2562 3184.3679 3193.1477 3533.8523
redmass: 3.9278 5.9657 5.0094 6.1370 4.7450 8.2202 3.5576 2.8552 3.5945 5.6362 1.7222 8.8744 5.8211 4.3879 3.5324 1.9290 1.4755 1.6729 7.3582 3.1312 4.3904 2.5411 5.0573 8.5102 3.5402 7.7198 4.6127 4.3840 2.1737 5.3424 4.7474 4.4838 3.0227 1.3925 4.6319 5.1161 7.0264 7.4932 5.8197 5.3445 1.5246 2.3035 2.0455 2.2164 1.7972 1.3875 1.8575 9.4588 5.6986 2.0727 1.8201 1.3848 1.2454 1.3922 2.1034 3.8208 2.5180 1.4335 5.0893 3.1597 1.9917 1.9640 2.8494 2.0592 1.3294 2.5111 1.6287 11.0525 1.2817 3.3389 1.3053 1.2817 1.1296 1.1408 1.3227 2.4277 1.3787 1.5507 1.3567 9.8787 1.3901 8.9676 1.2278 1.2077 2.4184 1.6405 1.7144 1.0664 1.0724 1.0551 1.0477 1.0796 1.0620 1.0621 7.1985 7.5034 10.3559 9.2451 1.0819 1.0600 1.0604 1.0370 1.0365 1.1003 1.0922 1.0702 1.0587 1.0989 1.0997 1.0990 1.0995 1.0992 1.1081 1.0887 1.0923 1.0986 1.0644
irintensity: 0.1615 0.4922 2.0244 0.1585 1.9896 0.1228 1.1714 0.1816 0.6330 1.5135 0.1392 0.7066 0.4380 1.8434 0.6455 0.1200 0.0239 1.0341 2.8638 4.5043 7.5224 0.2778 7.1653 6.7666 2.8360 5.3735 3.9322 7.1322 0.5909 9.4554 15.4975 12.7204 22.2918 86.7466 52.0023 51.2764 15.1113 27.0555 3.0280 12.0732 14.9958 30.4335 15.6719 1.6159 1.0730 12.6216 28.9239 3.3096 28.0260 2.5106 9.6548 0.0146 5.9275 16.5384 15.9207 311.9758 23.0359 8.7426 182.4289 1.6188 43.8958 1.9301 62.7706 16.0811 3.4058 0.8033 13.2184 181.0371 3.4149 277.1573 13.7273 3.7317 0.5881 8.5875 10.6219 60.0391 4.8291 1.2349 0.2847 82.2312 3.1208 65.9815 13.0183 12.4339 2.4734 19.2553 6.8215 0.4104 11.4864 7.1245 5.7735 36.9002 9.7650 7.5449 43.7875 16.9559 151.3818 247.0817 13.8715 6.2547 77.7607 35.7416 21.0979 4.9540 65.5733 30.6237 28.9416 44.8029 54.6655 47.0161 58.7302 19.6623 19.2810 6.1471 3.7480 2.5456 60.8661
temp: 298.150 k
press: 1.00000 atm
elementType: 8 8 8 8 8 8 7 6 6 6 6 6 6 6 6 6 6 6 6 6 6 6 1 1 1 1 1 1 1 1 1 1 1 1 1 1 1 1 1 1 1
symmnumber: 1
zpe: 844430.0 jmol-1
zpe.correction: 0.321626 hartree
zpe.thermalcorrener: 0.343482 hartree
zpe.thermalcorrenthalpy: 0.344426 hartree
zpe.thermalcorrgfe: 0.268995 hartree
zpe.sumelectzpe: -1087.352895 hartree
zpe.sumelectthermal: -1087.331039 hartree
zpe.sumelectthermalent: -1087.330095 hartree
zpe.sumelectthermalfe: -1087.405526 hartree
dipole: 2.1229 4.3733 -2.2158
dipole: 5.3425
quadrupole: -104.7125 -129.5081 -135.7587
quadrupole: 11.4850 -1.6410 -0.0239
quadrupole: 18.6139 -6.1816 -12.4323 11.4850 -1.6410 -0.0239
hfenergy: -1087.6745213 hartree
pointgroup: C01 [X(C15H19N1O6)]
dipole: -0.9679802 0.7317533 1.7162544 debye
polarizability: 249.1195501|9.3825809|176.5643594|-2.6356457|36.0211483|164.7197785 unknown
InChI: InChI=1S/C15H19NO6/c1-3-10(4-2)8-9-22-15(19)13-11(14(17)18)6-5-7-12(13)16(20)21/h5-7,10,17H,3-4,8-9H2,1-2H3
charge 0 multiplicity 1
41 atoms
O  0.536324 -0.778069 0.118409
O  0.280993 1.03338 -1.348144
O  -2.115927 2.799484 2.307433
O  -0.113082 1.9202 1.537949
O  -2.835173 -2.661733 -2.329682
O  -0.806844 -1.629443 -2.296937
N  -2.022952 -1.758566 -1.893836
C  4.282617 0.249016 0.455421
C  2.753992 0.178074 0.73835
C  4.615196 0.776445 -0.972081
C  5.023159 -1.094638 0.710644
C  2.012554 -0.819827 -0.161188
C  3.950718 2.122561 -1.338374
C  4.876917 -1.655461 2.142179
C  -0.179847 0.181424 -0.558565
C  -1.657638 0.089942 -0.206194
C  -2.235431 0.971035 0.755948
C  -2.536249 -0.803145 -0.869077
C  -3.63038 0.947815 1.011726
C  -3.923927 -0.84283 -0.61005
C  -4.472497 0.045625 0.332021
C  -1.363501 1.904441 1.532828
H  4.688998 0.99067 1.178494
H  2.309564 1.177636 0.597191
H  2.578789 -0.093299 1.795802
H  5.717243 0.880953 -1.04463
H  4.335884 0.012752 -1.727482
H  6.099599 -0.935833 0.495989
H  4.680647 -1.854571 -0.021949
H  2.276906 -1.867395 0.051449
H  2.156936 -0.599841 -1.232943
H  4.330704 2.49502 -2.307775
H  4.168408 2.893296 -0.573961
H  2.85321 2.029834 -1.425879
H  5.501098 -2.557754 2.278791
H  5.194622 -0.908743 2.894664
H  3.832788 -1.937229 2.370946
H  -4.03405 1.642131 1.75235
H  -4.53817 -1.565265 -1.153401
H  -5.546835 0.032448 0.536723
H  -1.494561 3.394756 2.806136
