program: Gaussian 09
title: 000270465
version: EM64L-G09RevD.01
frameworkgroup: C1[X(C7H9NO)]
method: RPBEPBE
basis: SDD
operation: Freq
keyword: #pfreq=noraman
keyword: PBEPBE/SDD
title: #p freq=noraman PBEPBE/SDD
converged: YES YES NO NO
title: Mulliken charges:
elementType: O N C C C C C C C H H H H H H H H H
charge: -0.261945 -0.429303 0.295246 0.375391 0.161261 -0.530317 -0.810658 -0.794475 -0.204214 0.260128 0.331467 0.234801 0.234794 0.232902 0.249591 0.240214 0.240212 0.174904
chargesum: 0.00000
title: Mulliken charges with hydrogens summed into heavy atoms:
elementType: O N C C C C C C C
charge: -0.261945 -0.097836 0.295246 0.375391 0.161261 -0.270188 -0.108160 -0.064458 -0.029310
polarizability: 1.19919950e+02 -7.11821659e+00 9.94019650e+01 7.22204056e-04 -2.23003762e-04 4.55897407e+01
1716.lowfreq: -77.9021 -5.4647 -0.0011 -0.0007 -0.0004 4.0187 9.5076 68.0661 139.2853
frequency: -77.7509 68.0091 139.2836 148.6299 197.2950 235.0690 243.9494 360.9635 383.3143 531.1550 581.9633 631.1213 653.7251 657.3850 705.5600 825.4838 839.9812 951.2171 973.6321 991.5855 998.4597 1039.6722 1042.5182 1149.5043 1165.5265 1243.9492 1330.9847 1369.7113 1401.0611 1406.3562 1408.0606 1457.0897 1468.5091 1471.4411 1476.3315 1490.8881 1499.4177 1551.3839 1599.4617 2921.0589 2976.4208 2981.6206 3049.1034 3057.7410 3089.4648 3103.5135 3209.2759 3565.1627
redmass: 1.0225 1.0385 5.0606 5.3318 3.1085 2.5861 2.6887 3.4167 3.1321 4.2466 4.4087 3.3354 4.3705 3.2059 1.2838 1.2584 3.7408 1.6673 1.5222 1.6472 2.9130 1.4994 1.4840 4.2699 1.4104 1.4674 2.4755 1.9301 1.4346 1.6011 1.7135 2.2135 1.0435 1.0448 1.4434 1.8812 2.8690 4.4495 5.6499 1.0857 1.0389 1.0378 1.0980 1.0978 1.0980 1.0965 1.0982 1.0805
irintensity: 0.2086 0.4358 0.0185 8.9747 11.2388 2.3794 2.3876 7.3415 7.5545 0.1898 0.0434 0.0615 18.6567 7.9636 76.4537 46.1892 13.1373 2.7592 5.7273 5.4157 1.7343 6.7558 7.0315 1.9810 19.8994 69.1470 28.1602 35.3320 30.1357 5.0787 5.9596 55.8064 11.9717 18.5794 5.0901 1.1106 27.9599 178.8965 272.0614 103.6097 37.5808 31.1029 17.7426 19.0549 19.2561 12.2636 4.9594 74.3136
temp: 298.150 k
press: 1.00000 atm
elementType: 8 7 6 6 6 6 6 6 6 1 1 1 1 1 1 1 1 1
symmnumber: 1
zpe: 380669.7 jmol-1
zpe.correction: 0.144989 hartree
zpe.thermalcorrener: 0.153556 hartree
zpe.thermalcorrenthalpy: 0.154501 hartree
zpe.thermalcorrgfe: 0.111299 hartree
zpe.sumelectzpe: -401.455898 hartree
zpe.sumelectthermal: -401.447331 hartree
zpe.sumelectthermalent: -401.446387 hartree
zpe.sumelectthermalfe: -401.489588 hartree
dipole: -3.3642 2.1616 0.0000
dipole: 3.9988
quadrupole: -51.9328 -53.8882 -55.6429
quadrupole: 11.0344 0.0000 0.0002
quadrupole: 1.8885 -0.0669 -1.8216 11.0344 0.0000 0.0002
hfenergy: -401.6008878 hartree
pointgroup: C01 [X(C7H9N1O1)]
dipole: -1.4253313 0.6659651 0.0003612 debye
dipolederiv: -0.812951 0.1855898 0.0000988 0.7996126 -0.9601439 -0.0002207 0.0002242 -0.000144 -0.3618808 -0.0330601 0.0231739 -0.0000323 0.0591059 -0.6957205 -0.0001042 -0.0000035 -0.0001193 -0.2182276 0.5733394 0.0668779 -0.0000605 -0.214271 0.3368648 0.0001154 -0.0001317 0.0000924 -0.0530769 0.1373394 -0.0277559 -0.0000553 0.4607981 0.425347 -0.0000063 0.0000658 0.0001115 -0.0053801 -1.1396994 0.4525568 0.0002729 0.3469408 -0.0505963 -0.0000376 0.0002281 -0.0000712 -0.0394353 -0.4315965 -0.1434365 -0.0000007 -0.4722065 -0.1631402 0.0000811 -0.0000334 0.0000308 -0.2721245 0.0434151 -0.1439385 -0.0000288 -0.0535746 -0.0202398 -0.0000103 -0.000013 -0.0000334 0.0781137 -0.0209691 -0.0105445 0.0000226 -0.1626752 0.0029756 0.000014 -0.0000652 -0.000023 0.0937108 1.5471785 -0.4310721 -0.0003066 -0.6378736 0.9948226 0.0002441 -0.0003611 0.0002197 0.0836419 -0.001477 0.0802135 0.0000424 0.0882909 0.0299475 -0.0000342 0.0000538 -0.0000387 0.1906183 0.2142132 0.0274741 0.0000223 -0.0289633 0.2326221 -0.0000066 0.0000112 -0.0000071 0.3119798 0.0108553 -0.0626698 -0.1099488 -0.0069443 0.0266743 0.00685 -0.1091237 -0.0529709 -0.038642 0.0108428 -0.0626892 0.1099425 -0.0069512 0.0266769 -0.0068571 0.1091272 0.052988 -0.0386184 -0.0139709 0.160401 0.0000144 0.0631024 -0.0535144 -0.0000164 0.0000076 -0.0000129 0.113649 -0.030667 0.0513463 0.0000494 0.1452721 0.0030651 -0.0000601 0.0000699 -0.0000359 0.1227967 0.0111725 -0.0251902 0.018361 -0.0789872 0.0045013 -0.1052589 -0.0558187 -0.1262364 -0.0378831 0.0112052 -0.0251182 -0.018405 -0.0789428 0.0044002 0.1053128 0.055764 0.1262641 -0.0377918 -0.0751706 -0.1152186 0.0000119 -0.2217332 -0.1445422 -0.000005 -0.0000015 -0.0000137 0.1085502 unknown
polarizability: 121.4388767|-4.1468652|97.8830346|-0.0122412|0.0096577|45.5897442 unknown
InChI: InChI=1S/C7H9NO/c1-5-3-6(2)8-7(5)4-9/h3-4,8H,1-2H3
charge 0 multiplicity 1
18 atoms
O  2.454923 -1.695147 -0.00057
N  -0.331076 -1.028238 -0.000061
C  0.075072 1.215006 0.000308
C  -1.567863 -0.412444 0.000305
C  0.693526 -0.067225 -0.000016
C  -1.335009 0.985085 0.00042
C  0.771909 2.553569 0.000476
C  -2.857306 -1.182368 0.000426
C  2.078916 -0.475193 -0.000289
H  -2.112338 1.748601 0.00064
H  -0.128062 -2.029493 -0.000284
H  1.414842 2.682838 0.890878
H  1.414887 2.683038 -0.889862
H  0.035098 3.37434 0.000551
H  -3.712663 -0.488221 0.000783
H  -2.950283 -1.830035 -0.892148
H  -2.949875 -1.830453 0.892739
H  2.823103 0.354838 -0.000297
