program: Gaussian 09
title: 000276057
version: EM64L-G09RevD.01
frameworkgroup: C1[X(C10H11Cl2N3O3)]
method: RPBEPBE
basis: SDD
operation: Freq
keyword: #p
keyword: freq=noraman
keyword: PBEPBE/SDD
title: #p freq=noraman PBEPBE/SDD
converged: YES YES NO NO
title: Mulliken charges:
elementType: Cl Cl O O O N N N C C C C C C C C C C H H H H H H H H H H H
charge: -0.039651 -0.056276 -0.310152 -0.254225 -0.229926 -0.469741 -0.189562 0.045731 0.338190 -0.331592 0.160113 0.302632 -0.262380 -0.300780 -0.570898 -0.110816 -0.253120 -0.526135 0.276398 0.271204 0.395409 0.325888 0.248722 0.277817 0.295922 0.256912 0.229010 0.252562 0.228747
chargesum: 0.00000
title: Mulliken charges with hydrogens summed into heavy atoms:
elementType: Cl Cl O O O N N N C C C C C C C C C C
charge: -0.039651 -0.056276 -0.310152 -0.254225 -0.229926 -0.074332 -0.189562 0.045731 0.338190 0.216010 0.160113 0.302632 0.063507 -0.052058 0.002841 -0.110816 0.003792 0.184183
polarizability: 2.45013503e+02 8.71783898e+00 2.01664922e+02 -9.72920465e+00 5.20677682e+00 7.71823602e+01
1716.lowfreq: -7.3049 -0.0015 -0.0010 0.0019 0.8200 3.9140 17.0482 25.6303 41.5627
frequency: 16.4664 25.6157 41.5572 57.5945 75.1593 81.5234 92.2554 128.7264 137.9464 150.7880 176.0945 212.7727 218.6305 232.2129 267.4061 275.5344 308.9660 339.2444 354.7278 366.5757 380.4152 448.7455 457.1791 471.9113 540.7642 574.9744 591.2392 619.2768 688.2740 704.7540 724.6907 727.0570 759.5101 793.4927 798.8505 847.6844 851.8591 889.3989 908.9308 921.2141 926.1126 991.9740 1040.5700 1053.2925 1077.0173 1090.2695 1117.0715 1130.4491 1153.0070 1198.7971 1208.4085 1244.1285 1261.7844 1266.9477 1274.4697 1324.4829 1358.0689 1377.3171 1387.9871 1419.9801 1435.3639 1437.8630 1454.5672 1467.0224 1468.1921 1482.1567 1517.9188 1597.2974 1604.4252 1651.8024 2970.5705 3046.3497 3062.7734 3069.4551 3120.3908 3135.5530 3159.4314 3161.8602 3182.3064 3199.7180 3417.4680
redmass: 5.8326 8.2338 12.2180 3.0475 3.8356 6.9317 5.4924 7.3877 5.6681 8.4906 7.3114 4.5727 1.9080 2.2964 6.2632 6.9638 5.7437 3.2420 5.4069 7.7765 7.2153 7.0767 3.8413 11.0954 4.9982 4.4437 7.0612 7.1620 7.6625 7.6634 3.7008 2.8364 2.2861 1.4694 3.1354 4.2947 1.1621 6.3960 1.3495 1.3545 3.0422 8.8111 2.1424 2.5027 2.1107 3.7005 1.2555 1.6281 1.4464 2.0298 1.8236 2.4641 2.2103 1.2847 1.5420 1.2228 1.3137 7.2511 7.7933 3.1038 1.3397 1.1383 1.0928 1.3722 1.0501 1.4751 2.6186 5.6397 7.5336 10.0590 1.0325 1.0590 1.1046 1.0558 1.1050 1.1003 1.1129 1.0882 1.0968 1.0933 1.0762
irintensity: 0.4811 0.5600 0.1034 0.7855 1.7702 1.7722 0.3455 11.4152 5.0474 3.9504 5.9116 2.4293 1.3796 0.6875 1.8294 8.6872 4.2942 8.2053 0.5836 0.8500 26.3384 6.0579 11.1741 7.3343 1.2515 4.2246 52.1397 18.3534 28.3076 56.7003 0.3906 1.5494 41.9937 45.5017 85.7542 34.0951 90.9772 2.9357 17.7373 17.2953 170.7159 49.0946 84.4274 11.5162 13.3645 88.1021 0.1055 31.3792 6.2128 69.7006 2.8584 63.5099 73.0308 2.0103 6.4559 34.7356 20.0012 189.1481 0.1399 70.8969 1.7887 27.5747 10.4203 167.9538 15.9515 58.2870 687.5834 3.6374 110.8589 228.5389 62.3758 1.8140 39.2140 13.0543 1.3030 13.5742 2.6101 5.5332 2.8719 9.8913 81.5384
temp: 298.150 k
press: 1.00000 atm
elementType: 17 17 8 8 8 7 7 7 6 6 6 6 6 6 6 6 6 6 1 1 1 1 1 1 1 1 1 1 1
symmnumber: 1
zpe: 543132.4 jmol-1
zpe.correction: 0.206868 hartree
zpe.thermalcorrener: 0.225235 hartree
zpe.thermalcorrenthalpy: 0.226179 hartree
zpe.thermalcorrgfe: 0.156898 hartree
zpe.sumelectzpe: -1696.318946 hartree
zpe.sumelectthermal: -1696.300579 hartree
zpe.sumelectthermalent: -1696.299635 hartree
zpe.sumelectthermalfe: -1696.368916 hartree
dipole: -3.9576 4.4762 0.6251
dipole: 6.0074
quadrupole: -121.9873 -121.3686 -117.8162
quadrupole: -17.2952 -2.2668 1.3150
quadrupole: -1.5966 -0.9779 2.5746 -17.2952 -2.2668 1.3150
hfenergy: -1696.525814 hartree
pointgroup: C01 [X(C10H11Cl2N3O3)]
dipole: -1.4757095 -1.7964536 -0.4256582 debye
polarizability: 245.1834882|-8.0255795|199.3001427|12.5102254|15.4103483|79.3771539 unknown
InChI: InChI=1S/C10H11Cl2N3O3/c1-18-9-3-2-7(12)6-8(9)13-10(16)15(14-17)5-4-11/h2-3,6,13H,4-5H2,1H3
charge 0 multiplicity 1
29 atoms
Cl 5.888068 2.06325 -0.18791
Cl -3.726785 3.280294 0.109112
O  -1.538395 -2.291739 -0.481257
O  1.170783 1.733655 0.454237
O  3.591688 -2.160206 0.055362
N  0.125097 -0.341706 0.013896
N  2.469455 -0.2138 0.302175
N  2.450093 -1.594228 0.039603
C  -1.235781 0.033274 -0.090265
C  3.709717 0.53299 0.611194
C  -2.150582 -1.033248 -0.360788
C  1.191644 0.48692 0.265273
C  -1.720333 1.353127 0.05338
C  -3.529545 -0.778184 -0.484153
C  4.302209 1.164313 -0.659807
C  -3.10478 1.576206 -0.076076
C  -4.018773 0.542932 -0.340648
C  -2.391632 -3.450463 -0.758548
H  3.459449 1.319232 1.339596
H  4.423258 -0.184669 1.04981
H  0.326065 -1.343762 -0.11864
H  -1.025742 2.168588 0.260099
H  -4.233322 -1.589078 -0.690456
H  4.591727 0.412266 -1.407594
H  3.636126 1.92678 -1.086954
H  -5.087448 0.752531 -0.434325
H  -3.124896 -3.604866 0.055552
H  -1.705376 -4.307591 -0.810883
H  -2.918488 -3.330919 -1.724189
