program: Gaussian 09
title: 000270461
version: EM64L-G09RevD.01
frameworkgroup: C1[X(C20H25NO2)]
method: RPBEPBE
basis: SDD
operation: Freq
keyword: #p
keyword: freq=noraman
keyword: PBEPBE/SDD
title: #p freq=noraman PBEPBE/SDD
converged: YES YES NO NO
title: Mulliken charges:
elementType: O O N C C C C C C C C C C C C C C C C C C C C H H H H H H H H H H H H H H H H H H H H H H H H H
charge: -0.342882 -0.270349 -0.462527 0.036973 -0.093383 -0.053461 -0.715593 -0.718064 -0.728642 -0.724443 0.237732 0.481488 0.371745 -0.474278 -0.372937 -0.380061 -0.392874 0.335928 -0.394838 -0.396482 -0.236418 -0.235417 -0.243793 0.229451 0.222661 0.225002 0.213364 0.216500 0.215536 0.238586 0.210672 0.206997 0.226456 0.214688 0.225846 0.209940 0.213430 0.228700 0.327432 0.222194 0.298678 0.238370 0.237956 0.237878 0.234862 0.224660 0.224002 0.228716
chargesum: 0.00000
title: Mulliken charges with hydrogens summed into heavy atoms:
elementType: O O N C C C C C C C C C C C C C C C C C C C C
charge: -0.342882 -0.270349 -0.135095 0.266424 0.129279 0.171541 -0.070194 -0.061809 -0.061652 -0.072373 0.237732 0.481488 0.371745 -0.252084 -0.074259 -0.141691 -0.154918 0.335928 -0.156960 -0.161620 -0.011759 -0.011416 -0.015077
polarizability: 4.10181564e+02 3.00813433e+00 2.00161821e+02 -2.05663559e+00 -2.49044467e+01 1.52809905e+02
1716.lowfreq: -13.9719 -4.7427 -0.0007 -0.0004 0.0015 4.8403 17.4443 22.6757 39.1785
frequency: 15.9471 21.8849 39.0748 48.8492 60.2619 67.3441 80.3271 85.3243 102.5082 121.3823 139.2192 180.3876 198.1752 206.1794 212.3112 222.4647 236.7371 252.5318 269.7419 292.8253 299.7372 323.5402 338.7895 361.5821 380.9963 404.1172 405.3937 412.2388 425.3507 431.7166 500.5368 524.0557 550.5680 553.5839 612.4320 616.5106 634.8544 638.9983 693.4413 697.3276 700.9917 728.4033 732.6264 770.2877 799.9570 826.5830 830.0848 848.4123 856.3807 857.7253 890.1800 911.8587 916.6941 921.2023 928.5013 947.0059 954.3135 961.1771 971.9667 979.8085 982.0136 988.0685 990.2969 992.2998 992.6168 1018.1945 1041.1946 1067.4024 1084.2160 1128.1672 1130.3780 1136.8938 1159.4711 1168.6964 1172.8192 1181.6200 1190.0305 1202.2324 1209.8350 1263.0436 1267.6663 1292.6128 1298.2085 1304.2798 1306.3503 1318.5265 1327.7092 1341.6524 1359.2770 1370.5022 1375.0612 1376.0653 1378.4613 1396.3554 1399.9771 1421.4591 1436.5528 1464.8351 1468.0215 1470.9442 1477.1100 1477.4217 1479.5948 1486.3196 1491.2510 1496.8895 1501.1451 1525.6546 1577.7339 1591.2058 1612.5281 1627.0094 1652.7198 2975.5489 2976.8235 2978.9585 2980.8386 2984.5758 2987.1383 3007.9744 3063.8375 3069.2062 3071.6320 3072.6695 3076.6821 3085.5150 3095.2267 3096.2751 3113.7521 3121.1589 3125.7310 3137.0216 3139.6606 3146.7831 3148.4259 3164.0703 3189.2174 3541.0604
redmass: 3.5276 4.5870 3.5221 4.7774 4.7818 3.4664 4.3688 2.9706 4.9042 4.4433 3.7491 3.3062 1.5659 1.5348 2.3590 1.2091 1.0803 3.5784 1.8283 2.6075 4.1429 3.1206 4.1946 5.4186 2.6696 2.4553 2.8212 2.9625 4.2085 2.9637 3.2920 5.2673 2.5407 2.4741 6.1918 5.9671 6.8946 1.2930 6.8784 5.8761 1.7344 3.3455 5.8139 1.9448 2.7456 1.5005 3.9758 1.2792 2.2822 1.4631 4.1632 1.3540 1.4516 1.2078 1.8050 1.3830 1.4262 1.3927 1.4287 4.0730 1.4952 2.9340 2.8079 1.3245 5.7503 2.7802 1.8841 1.5753 1.6196 1.6351 1.8826 2.3281 2.8180 2.0617 1.0524 1.9843 1.1101 1.1230 1.9593 1.7354 1.5695 3.1290 1.2102 1.4656 1.3711 1.3860 1.4433 1.4064 2.8211 1.4221 1.7070 2.8227 1.2092 1.2395 1.2030 4.1136 2.3752 1.0524 1.0488 1.0469 1.8779 1.1263 1.0517 1.0618 1.0552 2.1141 1.0550 3.1940 4.7986 5.9241 6.0174 6.2567 8.3752 1.0374 1.0384 1.0386 1.0729 1.0464 1.0775 1.0856 1.0993 1.0995 1.0990 1.0987 1.0995 1.0993 1.0979 1.0976 1.0883 1.0844 1.0874 1.0906 1.0920 1.0954 1.0956 1.1016 1.0945 1.0759
irintensity: 0.0539 0.3456 0.0966 0.0489 2.5178 0.2878 1.2779 0.8055 1.6213 1.3168 0.1235 4.7048 0.0159 0.5014 0.3439 0.2308 0.0695 9.2512 0.2486 0.4352 0.2962 1.4384 9.4615 5.2054 0.6294 2.9548 1.4179 0.1749 2.6369 1.9783 23.6468 0.8696 0.7483 9.3239 5.4472 4.6382 0.3865 39.7098 2.7739 42.5730 44.3027 9.5619 2.3894 81.8909 1.1301 24.4622 27.4104 0.4194 9.9005 42.7829 3.8317 21.6792 2.0633 21.6765 55.2522 2.7592 6.3373 4.3651 0.6961 252.8786 2.9476 11.9823 156.1722 1.5166 0.6431 40.6629 0.1904 16.2077 8.7143 41.7709 3.2020 55.7292 456.8143 61.2546 0.0542 48.0192 4.2793 20.7071 5.4432 3.0133 1.0638 1.5789 3.9613 5.2751 0.6410 38.1465 3.5217 13.8146 129.1793 1.5483 7.1615 17.2840 23.5444 19.5075 25.3389 43.6081 34.3175 4.7008 4.9450 0.0938 33.7087 5.4485 10.4447 18.9922 9.6961 499.2500 19.6613 356.8884 46.3424 33.8453 27.4046 99.6379 189.8813 26.2195 23.4180 28.2974 35.1976 28.5881 8.7014 24.3241 2.2436 5.5958 91.7254 61.0217 42.3148 37.2333 74.8482 10.7547 26.9209 6.3806 1.9174 16.1592 9.5096 7.3805 46.5072 29.7937 3.0707 28.3611
temp: 298.150 k
press: 1.00000 atm
elementType: 8 8 7 6 6 6 6 6 6 6 6 6 6 6 6 6 6 6 6 6 6 6 6 1 1 1 1 1 1 1 1 1 1 1 1 1 1 1 1 1 1 1 1 1 1 1 1 1
symmnumber: 1
zpe: 1057581.3 jmol-1
zpe.correction: 0.402811 hartree
zpe.thermalcorrener: 0.426018 hartree
zpe.thermalcorrenthalpy: 0.426962 hartree
zpe.thermalcorrgfe: 0.348333 hartree
zpe.sumelectzpe: -980.656678 hartree
zpe.sumelectthermal: -980.633472 hartree
zpe.sumelectthermalent: -980.632527 hartree
zpe.sumelectthermalfe: -980.711156 hartree
dipole: -1.3475 -1.4169 1.5682
dipole: 2.5065
quadrupole: -118.3649 -131.4532 -141.2361
quadrupole: 1.0537 -1.3304 -4.6995
quadrupole: 11.9865 -1.1018 -10.8847 1.0537 -1.3304 -4.6995
hfenergy: -981.0594897 hartree
pointgroup: C01 [X(C20H25N1O2)]
dipole: 0.5407785 -0.370997 -0.7364813 debye
polarizability: 409.5305684|10.8111807|187.0747088|-8.367785|32.4598253|166.5480122 unknown
InChI: InChI=1S/C20H25NO2/c1-14(2)19(15(3)4)23-20(22)21-18-12-10-17(11-13-18)16-8-6-5-7-9-16/h5-15,19,21H,1-4H3
charge 0 multiplicity 1
48 atoms
O  3.27674 -0.200648 -0.508204
O  1.942387 0.851541 1.131798
N  1.036659 -0.398025 -0.670391
C  4.525648 0.341712 0.148411
C  5.585834 -0.765018 -0.073172
C  4.766105 1.763147 -0.444107
C  6.973868 -0.373723 0.491246
C  5.119386 -2.095027 0.569354
C  5.589932 2.675237 0.499396
C  5.334332 1.739363 -1.881457
C  2.057174 0.15714 0.089408
C  -0.363085 -0.312719 -0.447821
C  -3.209867 -0.224032 -0.123976
C  -1.218886 -0.965404 -1.375129
C  -0.935504 0.387821 0.646643
C  -2.614421 -0.91982 -1.212366
C  -2.335379 0.42236 0.791959
C  -4.689224 -0.175366 0.047396
C  -5.323232 0.961166 0.623409
C  -5.511897 -1.263416 -0.358621
C  -6.723729 1.007988 0.788761
C  -6.912988 -1.216718 -0.197728
C  -7.527977 -0.080606 0.37801
H  4.30033 0.44297 1.229222
H  5.683387 -0.923076 -1.165999
H  3.754436 2.21531 -0.491423
H  6.906623 -0.087664 1.558185
H  7.435766 0.462555 -0.059861
H  7.65916 -1.238231 0.420413
H  4.143216 -2.41512 0.168657
H  5.855397 -2.896415 0.373388
H  5.022107 -1.987483 1.667217
H  5.158055 2.683942 1.517389
H  5.575389 3.714111 0.1209
H  6.645617 2.365232 0.576274
H  6.373485 1.36277 -1.90608
H  5.340649 2.759543 -2.307392
H  4.720189 1.099319 -2.540837
H  1.351931 -0.931573 -1.483546
H  -0.789794 -1.500177 -2.232198
H  -0.283849 0.883637 1.368748
H  -3.251116 -1.40518 -1.960257
H  -2.755288 0.941391 1.660973
H  -4.717501 1.826506 0.915438
H  -5.048124 -2.165784 -0.77328
H  -7.188668 1.897762 1.228301
H  -7.524054 -2.070974 -0.51084
H  -8.615625 -0.044423 0.504887
