program: Gaussian 09
title: 000276047
version: EM64L-G09RevD.01
frameworkgroup: C1[X(C13H20O2)]
method: RPBEPBE
basis: SDD
operation: Freq
keyword: #pfreq=noraman
keyword: PBEPBE/SDD
title: #p freq=noraman PBEPBE/SDD
converged: NO YES NO NO
title: Mulliken charges:
elementType: O O C C C C C C C C C C C C C H H H H H H H H H H H H H H H H H H H H
charge: -0.261238 -0.246493 -0.260053 -0.203209 -0.233496 -0.525081 -0.499520 -0.220583 -0.224041 0.214481 -0.328384 -0.397747 -0.031219 -0.705831 -0.712620 0.255527 0.241008 0.273745 0.246412 0.250774 0.262583 0.221891 0.239798 0.238384 0.234475 0.240961 0.208697 0.231091 0.205258 0.224353 0.207361 0.211401 0.215458 0.216480 0.209378
chargesum: 0.00000
title: Mulliken charges with hydrogens summed into heavy atoms:
elementType: O O C C C C C C C C C C C C C
charge: -0.261238 -0.246493 -0.004527 0.037799 0.040250 -0.027895 -0.015046 0.019215 0.014344 0.214481 0.147051 0.042040 0.174039 -0.062716 -0.071304
polarizability: 1.78025747e+02 2.35932667e+00 1.29038527e+02 1.54910045e+00 7.05253659e-01 1.12212917e+02
1716.lowfreq: -23.9946 -7.8837 -0.0003 0.0005 0.0005 4.0344 20.1888 30.4808 36.8831
frequency: 9.6103 29.9059 35.6946 63.0614 95.7738 108.5262 157.0876 201.0737 220.5385 237.4083 259.0346 286.1762 313.4690 348.7994 362.4791 366.5100 428.0226 475.1219 489.7433 556.1106 630.6387 671.8336 692.5806 718.7183 772.9603 776.4992 789.0126 792.8718 821.9328 857.4899 864.8687 901.3492 910.1292 915.6385 919.3277 930.6671 950.2326 953.6340 962.2833 981.8278 997.2273 999.0556 1012.9759 1019.7898 1032.3041 1089.0545 1105.6781 1117.6892 1134.4769 1140.5740 1153.3990 1161.9754 1181.1663 1192.7890 1230.9938 1235.5803 1252.3214 1263.7186 1272.0179 1280.0852 1284.4567 1297.1185 1322.3088 1332.3067 1334.6922 1343.8973 1377.1565 1381.3285 1399.5550 1452.1422 1460.2224 1465.8975 1471.0293 1474.8691 1479.7536 1485.0095 1492.3676 1578.7958 1625.3701 2965.3363 2971.9436 2976.3641 2988.6235 3021.2346 3023.3667 3034.6302 3042.7834 3064.0482 3066.0438 3068.4885 3072.4124 3075.4165 3083.0929 3091.3240 3091.8149 3100.4283 3113.1864 3153.6323 3186.9655
redmass: 3.5860 3.2766 4.1006 5.4364 2.7115 2.5667 4.0546 3.3744 1.1344 1.0384 3.0824 4.9746 4.2339 2.2304 2.2720 2.3483 3.7572 1.8333 2.8055 2.8401 3.8900 3.9237 4.9111 1.6552 3.3906 2.1271 2.6544 2.5021 2.7560 2.6047 4.1095 2.3681 2.2741 1.2071 2.2020 1.6380 2.5367 1.3548 2.0340 2.1231 1.8031 2.0002 1.9219 1.7818 1.9808 1.2570 1.4243 1.8380 1.9203 1.3040 1.5593 2.0119 1.3190 1.9395 1.3272 1.1994 1.5319 1.3379 1.6530 1.4640 1.4095 1.1666 1.7162 1.4874 1.4647 1.3972 1.3433 1.2243 1.2133 1.0951 1.0869 1.0450 1.0891 1.1091 1.0548 1.0505 1.0532 5.6796 8.5039 1.0797 1.0352 1.0360 1.0634 1.0591 1.0594 1.0579 1.1016 1.0995 1.0875 1.0997 1.0983 1.0994 1.0886 1.0934 1.1038 1.1067 1.1081 1.0872 1.1097
irintensity: 0.3215 0.0586 0.7812 0.5383 0.2746 0.6589 0.8083 0.6436 0.0385 0.2429 5.3232 4.4237 14.2329 1.4744 3.2222 0.5989 4.8000 3.0095 5.4565 1.7587 9.9402 3.1374 6.7993 50.5121 7.6799 4.7513 2.6676 0.6898 9.1132 6.6406 29.5200 2.6199 8.5644 3.5317 4.9351 4.9700 0.6976 0.2560 0.8987 15.8970 0.9247 10.6268 6.5387 8.1452 68.8400 10.3164 115.9385 226.6003 14.3648 23.1335 15.1541 12.4435 0.6564 8.2347 18.7303 3.1513 7.1430 2.3898 6.4362 20.1273 6.3575 1.8635 44.7496 25.9772 10.5759 14.3075 5.9126 19.7314 14.2666 8.2401 9.3985 1.5867 9.8227 12.0732 2.8683 21.2214 16.1598 2.8579 116.4063 16.9354 35.9761 26.6091 24.5097 40.2367 13.4941 36.1805 11.9012 11.8360 5.9825 27.5181 108.5532 50.2963 62.8633 13.2636 15.6884 20.6301 18.6265 7.4243 23.6952
temp: 298.150 k
press: 1.00000 atm
elementType: 8 8 6 6 6 6 6 6 6 6 6 6 6 6 6 1 1 1 1 1 1 1 1 1 1 1 1 1 1 1 1 1 1 1 1
symmnumber: 1
zpe: 795402.6 jmol-1
zpe.correction: 0.302953 hartree
zpe.thermalcorrener: 0.318287 hartree
zpe.thermalcorrenthalpy: 0.319232 hartree
zpe.thermalcorrgfe: 0.257703 hartree
zpe.sumelectzpe: -656.628786 hartree
zpe.sumelectthermal: -656.613452 hartree
zpe.sumelectthermalent: -656.612507 hartree
zpe.sumelectthermalfe: -656.674036 hartree
dipole: -0.6091 -1.2991 -0.1250
dipole: 1.4402
quadrupole: -81.3760 -94.7074 -91.1705
quadrupole: 1.6058 -2.1491 -0.7179
quadrupole: 7.7087 -5.6228 -2.0859 1.6058 -2.1491 -0.7179
hfenergy: -656.931739 hartree
pointgroup: C01 [X(C13H20O2)]
dipole: 0.2553138 0.288669 0.4153917 debye
polarizability: 178.0954113|-1.117355|117.1383768|1.9431303|7.6349431|124.0434038 unknown
InChI: InChI=1S/C13H20O2/c1-9(2)5-6-15-13(14)12-8-10-3-4-11(12)7-10/h3-4,9-12H,5-8H2,1-2H3
charge 0 multiplicity 1
35 atoms
O  0.89979 1.296649 -0.199362
O  0.185593 -0.486933 -1.524518
C  -1.962687 0.188082 0.926608
C  -3.589369 -0.270348 -0.598896
C  -1.466915 0.974457 -0.384392
C  -2.581633 -1.08512 0.272322
C  -2.578325 0.617474 -1.428722
C  -3.227829 0.925028 1.378035
C  -4.205314 0.646799 0.465648
C  -0.084554 0.496933 -0.792459
C  2.321421 0.894415 -0.439082
C  2.757058 -0.154232 0.595945
C  4.250984 -0.57935 0.488111
C  4.572635 -1.262675 -0.864316
C  5.223164 0.594691 0.764608
H  -1.175727 0.052642 1.683231
H  -4.295174 -0.840893 -1.220819
H  -1.406499 2.051504 -0.162628
H  -3.083308 -1.732961 1.010391
H  -1.860265 -1.667242 -0.327002
H  -2.14876 0.026527 -2.256261
H  -3.059618 1.517937 -1.844535
H  -3.274888 1.621829 2.219225
H  -5.212888 1.069864 0.422041
H  2.876969 1.839713 -0.33733
H  2.403024 0.506591 -1.469058
H  2.56651 0.252629 1.608641
H  2.11928 -1.050491 0.471678
H  4.407996 -1.334361 1.286893
H  3.864012 -2.084345 -1.076601
H  4.518497 -0.545415 -1.704833
H  5.594696 -1.684568 -0.855599
H  4.986451 1.097979 1.720997
H  6.266363 0.232438 0.820994
H  5.182813 1.353753 -0.039352
