program: Gaussian 09
title: 000270456
version: EM64L-G09RevD.01
frameworkgroup: C1[X(C22H21NO6)]
method: RPBEPBE
basis: SDD
operation: Freq
keyword: #p
keyword: freq=noraman
keyword: PBEPBE/SDD
title: #p freq=noraman PBEPBE/SDD
converged: YES YES NO NO
title: Mulliken charges:
elementType: O O O O O O N C C C C C C C C C C C C C C C C C C C C C C H H H H H H H H H H H H H H H H H H H H H
charge: -0.283647 -0.213699 -0.164380 -0.182890 -0.165279 -0.142192 0.027471 -0.040257 -0.392791 -0.044381 -0.343531 -0.716414 -0.717583 -0.723156 0.110705 0.306912 0.159577 0.184201 0.177441 0.288883 0.274923 -0.167598 -0.217517 -0.413590 -0.345709 -0.365892 -0.363416 -0.222954 -0.223311 0.206226 0.189614 0.207231 0.233199 0.220572 0.254760 0.227456 0.218986 0.206289 0.204450 0.219089 0.203650 0.193137 0.253532 0.210683 0.300550 0.290835 0.295813 0.292074 0.246314 0.245613
chargesum: 0.00000
title: Mulliken charges with hydrogens summed into heavy atoms:
elementType: O O O O O O N C C C C C C C C C C C C C C C C C C C C C C
charge: -0.283647 -0.213699 -0.164380 -0.182890 -0.165279 -0.142192 0.027471 0.165969 0.004053 0.188818 0.131801 -0.063682 -0.090394 -0.065805 0.110705 0.306912 0.159577 0.184201 0.177441 0.288883 0.274923 -0.167598 -0.217517 -0.113040 -0.054874 -0.070079 -0.071342 0.023360 0.022302
polarizability: 4.17541530e+02 -7.13428489e+00 2.87332122e+02 -2.46079240e+01 -3.37623277e+00 1.57219020e+02
1716.lowfreq: -7.6530 -4.2998 -0.0003 0.0006 0.0007 5.7040 14.1456 20.4521 23.6616
frequency: 12.1055 19.6433 23.4596 35.3408 46.9147 51.1283 66.9565 80.9266 93.7625 115.1546 130.4134 137.2396 153.7131 166.4047 172.4877 183.3974 199.9282 203.5211 214.9448 225.5519 233.0080 246.9232 260.9572 272.8091 296.3118 303.0607 329.8095 350.3612 356.6863 373.2585 397.5143 405.8407 418.0128 424.8530 436.1066 447.5720 457.0046 472.1457 487.2288 520.8336 578.7594 589.4413 605.2236 635.8173 648.8567 672.4548 677.2541 701.8707 712.9854 730.2700 749.2302 762.3569 782.4543 794.3784 808.2286 811.4315 835.1629 849.8179 865.0523 879.1940 895.6550 915.0390 924.5495 936.4469 946.9407 950.7241 957.0463 970.0194 985.5466 999.2079 1013.5491 1017.6850 1021.5989 1036.4069 1085.8029 1090.8296 1105.9392 1112.7042 1134.0493 1152.4367 1162.0650 1170.0917 1173.8402 1180.0359 1192.6618 1217.6008 1224.0660 1236.6966 1251.2014 1253.5655 1278.1315 1287.2812 1306.9171 1316.3701 1321.9561 1336.6394 1352.9317 1356.3305 1376.0493 1378.3682 1388.0390 1388.6397 1396.4185 1403.4250 1407.5603 1440.0730 1453.5150 1459.7512 1462.4897 1469.1336 1471.7981 1473.9446 1476.8531 1480.9374 1483.6816 1489.7507 1535.5817 1550.2096 1563.0521 1594.5772 1598.7172 1615.7105 1626.5914 2957.8832 2963.0703 2965.7628 2967.8123 2978.4103 2986.2829 3016.7318 3029.0390 3054.8096 3061.3272 3067.8376 3071.0186 3075.9455 3084.6754 3099.7208 3141.9858 3155.4292 3165.4439 3165.9397 3175.4109 3188.9357
redmass: 4.8109 4.5259 3.0948 4.8604 4.9815 8.3647 6.5538 4.7718 7.4338 5.5100 3.5295 5.8121 5.5095 6.3507 3.7571 6.7621 1.1184 2.5679 1.1908 1.9952 3.3352 4.9382 3.1314 5.5569 5.2469 6.9517 2.7338 5.2442 2.9524 10.2203 2.3106 5.7238 4.9486 3.9130 2.0990 4.6260 2.8401 8.1892 5.8440 5.3450 5.7204 3.2668 8.7324 7.2026 7.3666 7.6410 7.3851 5.7934 6.1315 2.6649 5.8972 5.8242 6.1705 3.0134 1.7539 2.7496 4.3589 2.8373 2.7904 1.9186 1.5522 1.3723 1.8143 1.8361 1.7753 5.0162 1.4152 5.9006 1.7517 1.3947 1.3832 1.3743 1.5288 2.0521 2.9979 2.4093 3.0773 1.5852 4.4704 2.0597 1.4995 2.1219 1.0993 1.8785 2.3704 1.5673 2.5813 7.4890 1.3379 1.5165 1.2478 2.4642 3.7197 1.4363 1.5868 1.4128 1.4969 1.2893 8.4881 1.2160 5.7900 1.2346 1.2273 10.3614 12.4499 2.5451 2.9884 1.0701 1.1158 1.0566 2.6316 1.0540 1.0530 1.0576 1.0583 1.0479 10.4038 9.9904 7.5322 7.5715 7.6634 7.8139 10.5483 1.0615 1.0496 1.0621 1.0404 1.0367 1.0819 1.0995 1.0584 1.0987 1.0987 1.0984 1.0987 1.0995 1.0999 1.1089 1.0866 1.0902 1.0946 1.0903 1.1006 1.0959
irintensity: 0.8430 0.5017 0.4812 1.0829 0.4594 1.7675 0.5299 0.9247 5.1046 0.1788 0.8449 0.3098 1.9192 0.9206 0.7175 0.1396 0.1139 1.8071 0.9590 1.5719 0.4993 0.7009 2.5533 2.8054 0.8022 0.7078 8.3574 2.6894 7.0127 19.0901 12.5929 5.7830 1.4200 1.5211 2.9948 6.0868 0.3468 0.5137 10.0767 3.1801 3.9945 2.6936 12.5452 11.2547 12.8171 1.2954 9.7216 6.4975 18.0362 45.7221 6.6284 14.8434 13.7708 0.8317 24.1175 6.1382 18.0368 5.8806 11.5712 9.8956 30.6567 4.4524 1.4114 1.1525 34.7804 74.6039 0.2892 8.2003 14.2120 4.0824 3.2819 0.2068 1.7299 7.1320 64.4065 5.6096 281.0368 16.4262 30.5596 12.7534 39.4180 9.2435 21.1297 11.8409 7.7853 9.4030 204.5037 155.1793 62.7977 105.5224 0.8786 93.7911 347.7940 0.1540 4.4935 0.9056 5.9218 1.1477 1.1955 16.0069 17.1935 16.6480 26.0409 4.5304 154.2505 2.1319 37.1259 1.3162 18.5307 1.8527 5.9025 5.5400 15.3863 5.1128 8.3324 29.7581 50.7874 123.5879 62.0986 12.4187 9.6564 11.2713 128.6649 10.8488 9.0620 48.4809 42.1800 33.4976 7.5460 54.3766 47.5724 18.2814 44.0110 61.6069 45.5282 48.3680 48.9780 10.4056 3.2406 3.6029 1.2727 1.5611 27.6790 0.0851
temp: 298.150 k
press: 1.00000 atm
elementType: 8 8 8 8 8 8 7 6 6 6 6 6 6 6 6 6 6 6 6 6 6 6 6 6 6 6 6 6 6 1 1 1 1 1 1 1 1 1 1 1 1 1 1 1 1 1 1 1 1 1
symmnumber: 1
zpe: 1009303.9 jmol-1
zpe.correction: 0.384424 hartree
zpe.thermalcorrener: 0.411589 hartree
zpe.thermalcorrenthalpy: 0.412533 hartree
zpe.thermalcorrgfe: 0.324421 hartree
zpe.sumelectzpe: -1354.878767 hartree
zpe.sumelectthermal: -1354.851601 hartree
zpe.sumelectthermalent: -1354.850657 hartree
zpe.sumelectthermalfe: -1354.938769 hartree
dipole: 1.9874 4.2378 -1.2831
dipole: 4.8533
quadrupole: -123.0724 -178.9800 -174.8993
quadrupole: -19.0910 -3.4038 6.7141
quadrupole: 35.9114 -19.9961 -15.9154 -19.0910 -3.4038 6.7141
hfenergy: -1355.2631902 hartree
pointgroup: C01 [X(C22H21N1O6)]
dipole: 0.7452648 -1.7487376 0.1801842 debye
polarizability: 417.4683159|-0.5040444|283.8500315|26.4993737|20.6183286|160.7743234 unknown
InChI: InChI=1S/C22H21NO6/c1-12(2)10-13(3)11-29-22(26)17-9-8-16-18(19(17)23(27)28)21(25)15-7-5-4-6-14(15)20(16)24/h4-9,12-13H,10-11H2,1-3H3
charge 0 multiplicity 1
50 atoms
O  -3.122031 -1.394179 -0.778189
O  -2.704441 0.831989 -1.36456
O  2.04651 2.250028 0.695981
O  3.612878 -2.957379 -0.145041
O  -1.042417 2.091916 0.846525
O  -0.141381 2.55464 -1.205287
N  -0.3909 1.784174 -0.216451
C  -5.319388 -1.243537 0.395973
C  -4.918875 -0.062069 1.321506
C  -5.304412 1.365392 0.843136
C  -4.600711 -1.206921 -0.967747
C  -5.106916 -2.604493 1.101216
C  -6.838597 1.56529 0.793567
C  -4.645971 2.41908 1.766299
C  1.435075 0.03775 -0.05974
C  1.84409 -1.322075 -0.205543
C  -0.872466 -0.632243 -0.669853
C  0.077269 0.362065 -0.322519
C  -2.304766 -0.28748 -0.972712
C  3.847902 0.662059 0.549121
C  4.261333 -0.687686 0.355825
C  2.419169 1.073175 0.406563
C  3.273479 -1.741285 -0.001058
C  0.904015 -2.319107 -0.552883
C  -0.440537 -1.980037 -0.765943
C  4.805809 1.644786 0.901231
C  5.624912 -1.038207 0.516335
C  6.161073 1.290144 1.053605
C  6.571914 -0.05402 0.860956
H  -6.399011 -1.149802 0.149333
H  -5.388877 -0.232351 2.312806
H  -3.823815 -0.102587 1.49611
H  -4.893865 1.522775 -0.174648
H  -4.900834 -2.060892 -1.598562
H  -4.762624 -0.257281 -1.505552
H  -4.043394 -2.746723 1.364498
H  -5.699482 -2.655892 2.032227
H  -5.413165 -3.449193 0.455361
H  -7.283592 1.422349 1.797961
H  -7.087918 2.58892 0.457924
H  -7.334654 0.860128 0.100246
H  -4.967109 2.278101 2.81739
H  -3.543629 2.348747 1.727871
H  -4.927562 3.444055 1.461515
H  1.25716 -3.350146 -0.644705
H  -1.18163 -2.741786 -1.018472
H  4.462977 2.673456 1.049282
H  5.912984 -2.083426 0.366928
H  6.898523 2.053671 1.321974
H  7.625594 -0.326082 0.981699
