program: Gaussian 09
title: 000270455
version: EM64L-G09RevD.01
frameworkgroup: C1[X(C15H16Cl4O4)]
method: RPBEPBE
basis: SDD
operation: Freq
keyword: #p
keyword: freq=noraman
keyword: PBEPBE/SDD
title: #p freq=noraman PBEPBE/SDD
converged: YES YES NO NO
title: Mulliken charges:
elementType: Cl Cl Cl Cl O O O O C C C C C C C C C C C C C C C H H H H H H H H H H H H H H H H
charge: 0.041430 0.060106 0.068847 0.072179 -0.233469 -0.222473 -0.411043 -0.180534 -0.026465 -0.380587 -0.373419 -0.381366 -0.732291 -0.325847 -0.709827 0.154996 0.417008 0.387160 -0.317526 -0.368739 -0.099044 -0.095683 0.067117 0.194721 0.205389 0.218343 0.194879 0.198767 0.208346 0.230337 0.216225 0.216098 0.201649 0.230118 0.233772 0.218801 0.215805 0.213317 0.392902
chargesum: 0.00000
title: Mulliken charges with hydrogens summed into heavy atoms:
elementType: Cl Cl Cl Cl O O O O C C C C C C C C C C C C C C C
charge: 0.041430 0.060106 0.068847 0.072179 -0.233469 -0.222473 -0.018141 -0.180534 0.168256 0.043146 0.020227 0.057317 -0.098319 0.138043 -0.061903 0.154996 0.417008 0.387160 -0.317526 -0.368739 -0.099044 -0.095683 0.067117
polarizability: 2.91316954e+02 -7.31082160e-01 2.46703903e+02 1.17355721e+01 5.03808242e+00 1.31331260e+02
1716.lowfreq: -3.9516 -0.0020 -0.0018 -0.0012 3.1416 4.2343 12.0749 27.0261 29.6018
frequency: 11.7403 26.9959 29.5679 38.6151 49.0091 55.7901 59.6157 77.9017 91.4000 110.7414 119.9451 135.6374 150.7522 167.1925 185.2586 191.9957 201.4164 204.3185 210.6891 220.5816 235.5715 244.9754 254.3926 273.3957 288.1734 292.1881 322.8547 327.2227 350.3286 355.4491 387.8176 413.1319 433.6471 462.5406 523.4988 546.2987 557.4490 578.0828 613.8443 632.4278 647.0192 675.2401 702.2866 732.2319 750.9917 757.8712 770.2350 791.9055 800.2977 820.2763 848.7297 875.8923 881.9510 930.5351 950.8999 966.1379 1015.1619 1018.6730 1028.7206 1053.5329 1059.8135 1080.7105 1123.6882 1147.0996 1164.8741 1182.6488 1209.4502 1220.4672 1234.8883 1258.1367 1278.6704 1288.1392 1295.8514 1316.8445 1336.3237 1337.8068 1339.4765 1351.7091 1359.7332 1373.6338 1383.6705 1387.0284 1390.6322 1448.2596 1457.3814 1469.0858 1471.5823 1474.8872 1480.7436 1485.2200 1492.3006 1523.2435 1552.6113 1616.0178 1665.1155 2951.0318 2966.7434 2970.2575 2975.2481 2980.3386 2986.3816 3014.1634 3023.2323 3033.0087 3054.6722 3060.9222 3067.7172 3069.8016 3072.4117 3103.2189 3516.8647
redmass: 6.8665 3.8849 5.6172 9.1524 5.9462 14.7684 4.5744 28.1654 3.9356 6.8276 4.6889 1.6397 6.1016 5.3184 1.8167 7.8553 6.2829 1.7901 23.3102 28.5865 2.0371 1.6752 10.2018 8.1989 3.0412 13.6003 3.5470 10.8326 20.3773 2.1968 10.1704 8.4187 2.6742 2.8597 3.8293 2.7635 4.2896 3.7328 5.1148 2.4768 9.6673 7.7114 7.6655 1.8479 3.8721 6.5873 3.3873 1.6422 2.3821 5.3266 9.9728 1.9962 4.7210 2.1016 1.5361 1.5189 4.1168 1.5731 1.7940 2.7079 2.0670 4.3525 2.1367 2.1570 4.2937 2.1297 1.2843 6.4087 1.3682 1.2343 2.7660 1.1273 1.3003 1.2671 2.4226 2.8660 5.3456 1.5880 1.4852 1.5337 4.5688 1.2272 1.2132 1.0800 1.1059 1.0626 1.0587 1.0537 1.0555 1.0648 1.0664 11.8936 11.9599 10.1960 10.1524 1.0802 1.0540 1.0428 1.0370 1.0606 1.0642 1.1004 1.0674 1.0873 1.0999 1.0985 1.0995 1.0996 1.0990 1.1087 1.0641
irintensity: 0.0442 0.1190 0.1317 0.2095 0.3724 0.3480 0.1443 0.0331 0.7092 1.5509 0.4594 0.1002 2.8953 0.4040 0.3185 1.0713 0.0527 0.7632 0.0641 0.0181 0.0697 0.1592 0.6134 0.9942 1.1769 0.3917 12.9246 3.6427 0.5984 0.0844 2.4397 3.3702 0.9208 2.1828 18.4873 14.1563 51.3311 22.3748 103.8434 73.8751 12.7173 9.0960 17.5523 3.7610 4.9176 3.9592 5.4211 5.1159 16.7632 17.5600 12.0158 6.5782 1.8913 2.1916 20.8203 10.7412 70.6773 20.9664 20.0111 4.6907 13.9426 291.6379 0.7811 5.7971 165.5430 0.2696 5.6974 354.3894 40.3381 7.4581 99.4165 1.1358 2.9435 8.5733 14.3376 1.2778 49.4731 2.0487 12.9691 8.3393 40.9770 11.6558 14.7598 3.9303 18.0502 7.1305 1.4009 14.8372 7.9682 28.5782 1.4121 36.2780 19.0750 138.2550 247.3547 14.9957 15.4788 63.4770 19.2243 14.4349 43.5838 22.8115 31.2168 2.0994 50.3991 42.7529 33.5656 64.2462 103.9546 14.7283 44.9341
temp: 298.150 k
press: 1.00000 atm
elementType: 17 17 17 17 8 8 8 8 6 6 6 6 6 6 6 6 6 6 6 6 6 6 6 1 1 1 1 1 1 1 1 1 1 1 1 1 1 1 1
symmnumber: 1
zpe: 739021.8 jmol-1
zpe.correction: 0.281479 hartree
zpe.thermalcorrener: 0.306834 hartree
zpe.thermalcorrenthalpy: 0.307778 hartree
zpe.thermalcorrgfe: 0.222578 hartree
zpe.sumelectzpe: -2720.582859 hartree
zpe.sumelectthermal: -2720.557503 hartree
zpe.sumelectthermalent: -2720.556559 hartree
zpe.sumelectthermalfe: -2720.641759 hartree
dipole: 3.0700 -0.3796 2.5302
dipole: 3.9964
quadrupole: -156.7545 -158.2346 -166.7232
quadrupole: -5.3494 -0.6380 -11.3385
quadrupole: 3.8163 2.3362 -6.1525 -5.3494 -0.6380 -11.3385
hfenergy: -2720.8643377 hartree
pointgroup: C01 [X(C15H16Cl4O4)]
dipole: 1.2534526 0.6051371 -0.7312774 debye
polarizability: 291.8381655|0.7910643|201.6267348|-5.6599144|56.9169357|175.8872158 unknown
InChI: InChI=1S/C15H16Cl4O4/c1-3-7(2)5-4-6-23-15(22)9-8(14(20)21)10(16)12(18)13(19)11(9)17/h7,20H,3-6H2,1-2H3
charge 0 multiplicity 1
39 atoms
Cl 0.248347 -1.588755 -1.574063
Cl -5.006083 1.344696 0.670029
Cl -2.651468 -2.634313 -2.40128
Cl -5.276343 -1.183953 -1.274634
O  1.054436 1.285131 -0.714286
O  0.584803 1.019854 1.56188
O  -1.366879 3.190195 0.836157
O  -2.6148 2.212232 2.539434
C  4.872694 -1.105321 0.238881
C  3.57147 -0.252577 0.295879
C  5.194188 -1.661423 -1.176492
C  3.541359 0.953479 -0.671528
C  6.091066 -0.335465 0.806539
C  2.383869 1.924942 -0.413419
C  4.090892 -2.557443 -1.78052
C  0.271239 0.908326 0.35443
C  -1.076255 0.39086 -0.1028
C  -2.244079 1.00421 0.432617
C  -1.212109 -0.722512 -0.961144
C  -3.521137 0.521182 0.066899
C  -2.491078 -1.212888 -1.315977
C  -3.651125 -0.581931 -0.808735
C  -2.117429 2.15431 1.400613
H  4.696974 -1.98137 0.900507
H  3.437281 0.11449 1.333375
H  2.699881 -0.900236 0.084973
H  6.135538 -2.244011 -1.110005
H  5.408348 -0.818641 -1.865268
H  4.471419 1.549248 -0.567453
H  3.49922 0.61071 -1.722518
H  5.882978 0.053776 1.820816
H  6.976827 -0.994562 0.871568
H  6.368946 0.522611 0.164466
H  2.409396 2.783908 -1.10405
H  2.367988 2.270507 0.635659
H  3.160491 -1.98992 -1.966796
H  4.414366 -2.99081 -2.744749
H  3.843046 -3.394161 -1.100227
H  -1.24298 3.912524 1.510324
