program: Gaussian 09
title: 000276041
version: EM64L-G09RevD.01
frameworkgroup: C1[X(C11H14N2O3)]
method: RPBEPBE
basis: SDD
operation: Freq
keyword: #p
keyword: freq=noraman
keyword: PBEPBE/SDD
title: #p freq=noraman PBEPBE/SDD
converged: NO YES NO NO
title: Mulliken charges:
elementType: O O O N N C C C C C C C C C C C H H H H H H H H H H H H H H
charge: -0.261871 -0.313581 -0.239831 0.028317 -0.388022 0.459233 0.325167 -0.367803 -0.374951 -0.353744 -0.339657 -0.388168 -0.220939 -0.673263 0.316179 -0.537256 0.224525 0.278270 0.251699 0.242840 0.205410 0.229318 0.229334 0.212741 0.228664 0.228665 0.304191 0.246108 0.224213 0.224214
chargesum: 0.00000
title: Mulliken charges with hydrogens summed into heavy atoms:
elementType: O O O N N C C C C C C C C C C C
charge: -0.261871 -0.313581 -0.239831 0.028317 -0.083832 0.459233 0.325167 -0.143278 -0.096681 -0.102046 -0.096817 -0.182758 0.237712 -0.003193 0.316179 0.157278
polarizability: 3.18879655e+02 5.34362973e-01 1.41384486e+02 1.41854216e-02 1.97647624e-03 7.26239265e+01
1716.lowfreq: -3.4750 0.0000 0.0005 0.0011 3.7106 11.6282 33.4464 42.3477 50.6362
frequency: 32.7577 42.3301 50.6038 62.7280 78.4836 108.3116 118.1319 147.7234 205.5680 209.6037 230.1702 233.1128 248.7848 265.9798 266.2328 348.2520 393.7189 405.4447 419.8514 433.5374 510.1465 530.2688 586.9599 628.6141 631.7441 687.2975 699.0050 735.5784 752.5845 802.6444 823.7458 837.5276 838.1404 863.3645 931.4829 963.0219 980.5956 981.9534 984.2474 1000.1775 1030.4715 1092.9544 1111.7776 1112.2444 1120.6606 1140.5473 1156.2362 1163.3356 1176.6758 1228.6978 1246.4165 1251.2027 1306.9454 1332.7816 1361.1328 1380.4884 1401.3374 1426.8249 1436.7323 1463.3546 1467.4247 1473.0001 1477.1008 1488.5437 1495.5576 1516.5643 1565.9000 1593.1273 1622.1324 1688.6174 2962.1094 2963.3238 2995.3977 3008.3749 3051.6447 3065.9919 3092.7932 3105.9205 3120.4572 3127.7276 3148.6429 3165.9299 3169.4028 3406.0952
redmass: 4.4999 4.9066 3.6858 3.3711 2.8207 3.3247 4.5385 4.3910 4.9335 2.3581 5.2479 1.6143 1.2153 4.3054 2.6253 3.9819 4.5625 5.4191 3.1315 4.9332 4.4494 2.4009 6.1798 7.1002 1.1829 11.4304 6.7038 3.6924 5.4085 1.0954 1.2589 1.5805 4.2379 4.1159 1.4494 1.4259 1.3550 5.8827 8.8369 2.5966 2.6968 4.9187 1.2593 1.6684 2.0574 1.4637 1.3732 2.4832 1.2458 2.3467 2.2616 1.1295 1.3933 1.7225 1.4126 3.4080 1.2706 3.4185 1.2429 1.0403 1.0501 1.0902 1.0576 1.1956 1.6150 2.2918 7.7285 6.1031 6.3854 10.6866 1.0366 1.0826 1.0357 1.0582 1.1041 1.1068 1.0986 1.1026 1.0896 1.0996 1.0877 1.0949 1.0964 1.0751
irintensity: 2.3063 2.3365 2.3219 5.2036 0.1522 11.7137 5.0392 0.0202 1.5105 0.7363 4.6682 12.8029 0.0799 12.1951 15.2840 4.2334 0.0053 12.1468 0.1859 12.4410 13.7591 17.6298 17.4464 0.4885 93.0957 26.6450 9.8530 2.2279 3.2453 3.9959 2.1161 64.4674 6.0516 20.8085 34.3562 7.6936 2.5447 196.5882 80.8330 15.4487 189.6156 209.8998 0.1867 16.1432 41.1195 5.0044 76.8194 773.4165 21.0418 88.9973 169.4593 0.0361 4.6980 15.6819 12.0252 29.4046 28.4625 0.3613 16.1543 11.8131 13.8161 117.7213 18.2148 113.8832 217.6939 71.7293 9.8122 10.7244 154.4100 404.7404 112.5448 30.1433 25.1317 28.3491 46.3674 9.2129 33.6702 48.0889 15.6232 26.4580 4.7059 10.9981 8.5119 6.8089
temp: 298.150 k
press: 1.00000 atm
elementType: 8 8 8 7 7 6 6 6 6 6 6 6 6 6 6 6 1 1 1 1 1 1 1 1 1 1 1 1 1 1
symmnumber: 1
zpe: 620760.3 jmol-1
zpe.correction: 0.236435 hartree
zpe.thermalcorrener: 0.252816 hartree
zpe.thermalcorrenthalpy: 0.253761 hartree
zpe.thermalcorrgfe: 0.190947 hartree
zpe.sumelectzpe: -761.512017 hartree
zpe.sumelectthermal: -761.495635 hartree
zpe.sumelectthermalent: -761.494691 hartree
zpe.sumelectthermalfe: -761.557505 hartree
dipole: 0.2046 1.7711 0.0010
dipole: 1.7829
quadrupole: -65.6844 -88.0144 -97.1627
quadrupole: -15.8675 -0.0027 -0.0030
quadrupole: 17.9361 -4.3939 -13.5422 -15.8675 -0.0027 -0.0030
hfenergy: -761.7484518 hartree
pointgroup: C01 [X(C11H14N2O3)]
dipole: -0.0918596 0.6953913 -0.000498 debye
polarizability: 318.8496674|2.3675847|141.4144609|0.0527984|-0.0111501|72.623939 unknown
InChI: InChI=1S/C11H14N2O3/c1-3-16-11(14)13-12-8-9-4-6-10(15-2)7-5-9/h4-8,13H,3H2,1-2H3
charge 0 multiplicity 1
30 atoms
O  -5.467017 -0.177325 -0.000279
O  4.607533 0.294887 0.001915
O  3.323496 -1.69028 0.00225
N  1.050258 0.061055 0.001777
N  2.36525 0.485051 0.002109
C  -1.305871 0.639809 0.000954
C  -4.079516 0.016878 0.000143
C  -2.287047 1.673301 0.000385
C  -1.745621 -0.712532 0.001111
C  -3.65772 1.370804 -0.000017
C  -3.116483 -1.028939 0.000713
C  0.116077 0.991448 0.001356
C  5.846091 -0.533489 0.001468
C  7.023662 0.436193 0.000686
C  3.405049 -0.445442 0.002524
C  -5.963106 -1.557212 -0.000249
H  -1.96852 2.723457 0.000256
H  -0.991963 -1.506645 0.00155
H  -4.418894 2.156816 -0.000458
H  -3.424191 -2.078954 0.000858
H  0.359878 2.074629 0.001247
H  5.834355 -1.182141 0.896287
H  5.833478 -1.182514 -0.893068
H  7.971987 -0.131412 0.00034
H  7.004143 1.080543 -0.895111
H  7.005026 1.08092 0.896232
H  2.626436 1.481879 0.001973
H  -7.059003 -1.466085 -0.000707
H  -5.6333 -2.10275 0.905155
H  -5.632567 -2.103054 -0.905202
