program: Gaussian 09
title: 000276034
version: EM64L-G09RevD.01
frameworkgroup: C1[X(C11H14N2O2)]
method: RPBEPBE
basis: SDD
operation: Freq
keyword: #p
keyword: freq=noraman
keyword: PBEPBE/SDD
title: #p freq=noraman PBEPBE/SDD
converged: YES YES NO NO
title: Mulliken charges:
elementType: O O N N C C C C C C C C C C C H H H H H H H H H H H H H H
charge: -0.312962 -0.237218 0.032974 -0.388495 0.444710 0.453988 -0.418332 -0.347389 -0.382071 -0.369052 -0.805566 -0.384819 -0.221027 -0.673194 0.316996 0.230803 0.231393 0.220431 0.277999 0.231810 0.234118 0.223781 0.205627 0.229819 0.229813 0.213251 0.228811 0.228820 0.304982
chargesum: 0.00000
title: Mulliken charges with hydrogens summed into heavy atoms:
elementType: O O N N C C C C C C C C C C C
charge: -0.312962 -0.237218 0.032974 -0.083513 0.444710 0.453988 -0.187529 -0.115996 -0.161640 -0.091054 -0.115857 -0.179191 0.238604 -0.002312 0.316996
polarizability: 2.98711327e+02 -2.78880534e+00 1.36131178e+02 1.33088657e-01 8.15383835e-03 7.09087152e+01
1716.lowfreq: -0.0007 -0.0006 0.0007 3.7480 6.8128 14.1124 30.4939 40.3781 46.4136
frequency: 30.4797 40.2944 46.3705 48.6112 61.6251 88.7262 126.3934 141.1727 208.4837 222.4957 243.9735 248.8317 252.4564 330.6015 349.8985 367.9218 411.1202 423.9996 470.9621 521.3827 597.8677 635.1598 637.2134 688.4944 699.4433 727.1817 770.5132 801.1744 826.3046 838.4277 859.0843 863.9995 931.4326 963.9126 979.9756 989.1665 996.0694 1011.6132 1031.0346 1046.6576 1096.1143 1116.1539 1126.9733 1140.4281 1163.5158 1188.6919 1223.3537 1242.7700 1250.8012 1309.3007 1333.8067 1360.5818 1377.8852 1397.5107 1401.1651 1415.7456 1463.7165 1468.9767 1473.4450 1476.8197 1488.7124 1498.8943 1518.8615 1565.2508 1594.3952 1624.0105 1690.0832 2965.9973 2975.5483 2995.7772 3008.9175 3053.2235 3066.5431 3084.8248 3092.6937 3106.6797 3111.4722 3122.8842 3138.6033 3160.6075 3406.2939
redmass: 3.1062 1.1657 2.6071 4.3663 4.2352 3.0434 4.4869 3.8188 3.2693 5.4638 5.3632 1.5001 2.4146 3.1995 3.6686 3.8875 2.8748 4.4318 5.7601 2.5154 5.5446 1.1875 6.9579 11.2659 6.7050 2.9706 4.5285 1.0953 1.3815 4.2102 1.2781 4.1234 1.4505 1.4304 2.9629 1.8407 1.3530 2.8506 2.7015 1.5655 5.3786 2.1959 1.5033 1.4675 2.8033 1.1136 2.7853 1.9744 1.1281 1.4267 1.5995 1.4216 2.9927 1.2558 1.2714 3.6194 1.0404 1.0482 1.1080 1.0580 1.1349 1.7647 2.4896 6.4752 5.9108 6.3250 10.6924 1.0869 1.0374 1.0358 1.0582 1.0972 1.1068 1.0988 1.0985 1.1026 1.0874 1.0894 1.0961 1.0956 1.0752
irintensity: 0.9997 0.7648 0.4814 1.5786 5.0376 0.8258 5.0846 5.8698 7.8744 2.2245 10.5301 3.1416 13.6714 0.3138 8.0512 4.4893 0.1659 9.1857 2.4676 18.1433 1.6450 91.4224 0.2014 27.2353 5.9597 5.0863 5.4604 4.0335 32.7433 3.8914 7.4751 14.9222 27.8876 14.4082 167.2733 37.1131 2.6112 9.2056 184.3912 13.6635 213.1422 2.7977 25.1346 5.0523 737.5947 5.2381 0.4024 39.9332 0.0256 4.8979 23.0791 3.2374 1.3630 12.1231 27.8552 4.1037 11.9261 13.2853 14.4695 25.1366 63.8136 232.9804 100.6126 2.0525 0.7784 29.2005 403.6481 66.9164 38.3520 24.5593 27.7326 20.5575 9.0811 20.9935 33.1306 47.7366 15.2359 19.8544 30.4072 3.3457 5.9273
temp: 298.150 k
press: 1.00000 atm
elementType: 8 8 7 7 6 6 6 6 6 6 6 6 6 6 6 1 1 1 1 1 1 1 1 1 1 1 1 1 1
symmnumber: 1
zpe: 609070.0 jmol-1
zpe.correction: 0.231983 hartree
zpe.thermalcorrener: 0.247596 hartree
zpe.thermalcorrenthalpy: 0.248540 hartree
zpe.thermalcorrgfe: 0.186766 hartree
zpe.sumelectzpe: -686.388926 hartree
zpe.sumelectthermal: -686.373312 hartree
zpe.sumelectthermalent: -686.372368 hartree
zpe.sumelectthermalfe: -686.434142 hartree
dipole: 0.1994 -3.3295 0.0107
dipole: 3.3355
quadrupole: -59.7639 -85.7645 -91.8521
quadrupole: 5.3597 0.0893 -0.0057
quadrupole: 19.3629 -6.6377 -12.7252 5.3597 0.0893 -0.0057
hfenergy: -686.6209084 hartree
pointgroup: C01 [X(C11H14N2O2)]
dipole: -0.0867878 -1.3089782 0.0338325 debye
polarizability: 298.7400047|1.7450002|136.0469857|-0.3201487|-1.8975163|70.9642301 unknown
InChI: InChI=1S/C11H14N2O2/c1-3-15-11(14)13-12-8-10-6-4-9(2)5-7-10/h4-8,13H,3H2,1-2H3
charge 0 multiplicity 1
29 atoms
O  4.197628 -0.377352 0.00122
O  2.992824 1.654863 -0.057238
N  0.654546 -0.005411 -0.005395
N  1.950886 -0.480758 0.006303
C  -4.492044 0.248855 0.001407
C  -1.722829 -0.488821 0.013421
C  -4.102905 -1.113418 0.039284
C  -3.466805 1.237341 -0.029339
C  -2.739969 -1.479729 0.044798
C  -2.107685 0.883071 -0.024026
C  -5.955266 0.652282 -0.012355
C  -0.314416 -0.898353 0.022232
C  5.469565 0.398606 -0.022652
C  6.60613 -0.618043 0.005714
C  3.026045 0.408825 -0.020778
H  -4.873606 -1.892922 0.064947
H  -3.747981 2.297514 -0.057406
H  -2.462307 -2.541312 0.074993
H  -1.322998 1.64613 -0.047014
H  -6.185888 1.355846 0.809401
H  -6.220705 1.162655 -0.95794
H  -6.619149 -0.222655 0.094469
H  -0.11337 -1.989548 0.053498
H  5.482707 1.021139 -0.935746
H  5.484589 1.07299 0.852811
H  7.577357 -0.090847 -0.011312
H  6.562207 -1.234594 0.919876
H  6.559568 -1.287573 -0.870259
H  2.172169 -1.48678 0.035486
