program: Gaussian 09
title: 000270453
version: EM64L-G09RevD.01
frameworkgroup: C1[X(C13H17NO4)]
method: RPBEPBE
basis: SDD
operation: Freq
keyword: #p
keyword: freq=noraman
keyword: PBEPBE/SDD
title: #p freq=noraman PBEPBE/SDD
converged: YES YES NO NO
title: Mulliken charges:
elementType: O O O O N C C C C C C C C C C C C C H H H H H H H H H H H H H H H H H
charge: -0.325076 -0.254444 -0.202002 -0.203321 0.027351 0.433741 -0.416873 -0.423680 -0.777404 -0.725884 -0.711246 0.211074 0.218812 -0.323319 -0.315249 -0.351840 -0.345556 0.387027 0.212011 0.254615 0.254669 0.208677 0.238512 0.218430 0.227954 0.224347 0.225166 0.223644 0.217862 0.221353 0.228684 0.282082 0.281297 0.290218 0.288368
chargesum: 0.00000
title: Mulliken charges with hydrogens summed into heavy atoms:
elementType: O O O O N C C C C C C C C C C C C C
charge: -0.325076 -0.254444 -0.202002 -0.203321 0.027351 0.433741 0.049754 0.039666 -0.092508 -0.052727 -0.043347 0.211074 0.218812 -0.041237 -0.033953 -0.061623 -0.057188 0.387027
polarizability: 2.49659688e+02 2.20801832e+00 1.58325712e+02 1.57743754e+00 -6.96482212e+00 1.04770103e+02
1716.lowfreq: -11.2805 -6.3340 -0.0004 0.0003 0.0007 4.7438 27.8921 29.6958 55.1779
frequency: 27.8407 29.5142 55.1014 66.2317 69.2621 88.9170 98.8359 122.0612 148.4597 190.6778 199.3927 222.3641 233.5168 246.4163 259.7477 278.2129 286.6975 327.8702 348.2986 378.6381 404.2389 410.0549 452.1097 479.3998 491.4671 519.6500 544.6184 623.4119 651.8897 671.5860 685.9850 701.8125 764.7059 766.3692 772.8803 788.7431 806.8230 835.9403 864.4578 888.6011 889.6736 963.9537 1004.3167 1004.6575 1009.0295 1012.2512 1015.3380 1045.0671 1068.0442 1077.9006 1078.9163 1090.1728 1107.4575 1130.9221 1174.5075 1206.3150 1214.1944 1217.6596 1248.8094 1273.7800 1290.9509 1314.6951 1337.1875 1349.9335 1366.8167 1389.0966 1394.1543 1397.2857 1404.6477 1413.4398 1458.0268 1467.1430 1470.9944 1473.0157 1478.2918 1483.4785 1485.5205 1490.5399 1492.7351 1584.5273 1607.8551 1610.7413 2986.0426 2987.3186 2993.7006 2995.4472 2999.9856 3056.5475 3059.7458 3079.7930 3081.6950 3087.5022 3087.9117 3096.6542 3103.7348 3164.8370 3175.7530 3187.5911 3193.5084
redmass: 4.4439 5.3604 2.9060 5.2110 3.8235 6.9419 2.4290 3.2556 2.1039 1.1842 4.9861 2.2778 3.2424 1.9691 1.3913 2.9638 5.7408 3.3398 2.4914 4.9015 2.8984 2.8985 3.7756 3.8483 6.7483 6.2289 2.9271 7.1189 6.2046 5.7423 3.9280 5.0374 2.8175 2.2455 5.1335 1.4621 2.3268 3.4924 1.2443 1.6858 1.7232 1.5809 1.8461 1.8608 1.6318 1.3654 1.5899 2.1932 3.2250 1.8778 2.1553 3.2305 1.3318 2.0301 1.2323 2.8804 2.4917 3.4718 3.6264 1.2948 1.2588 1.5845 1.5259 1.3928 7.7274 1.2652 1.2037 1.2001 7.9549 4.6899 1.0711 1.0545 1.2255 1.8421 1.0475 1.0505 1.0485 1.0652 1.0602 9.4342 6.5961 8.9506 1.0362 1.0359 1.0621 1.0573 1.0419 1.0985 1.0979 1.0988 1.0989 1.1008 1.1004 1.0996 1.0990 1.0899 1.0889 1.0958 1.0972
irintensity: 0.0050 0.0002 0.0571 0.0329 0.0279 5.6429 0.2355 0.6816 1.5194 0.4128 4.7160 1.4208 1.7371 0.8598 0.7715 1.0750 3.4898 5.8338 1.7082 2.1617 4.2782 0.0105 1.1806 0.4715 5.7412 3.5723 1.7401 0.3538 0.0755 8.0648 58.6287 0.7837 4.4032 1.5332 50.7031 9.0840 5.3791 50.7368 0.6306 29.5762 26.2027 26.9257 25.8448 26.6291 7.0158 0.0018 11.4733 3.8705 275.1599 36.0306 20.5538 9.0699 14.1157 69.1617 2.6490 189.6090 141.0795 209.6447 182.0834 10.1579 1.2416 3.1105 9.6971 6.9417 85.7558 13.9940 21.8144 19.0950 11.6885 60.5201 13.3076 3.2298 13.7927 3.7573 10.1183 25.8541 11.4638 8.3095 3.6203 79.8524 9.6622 65.7539 25.2390 31.9529 17.5251 25.7384 22.4757 0.0155 0.3796 34.5070 24.6820 39.6061 59.1986 37.1915 23.0067 1.4469 1.0768 0.2752 0.4500
temp: 298.150 k
press: 1.00000 atm
elementType: 8 8 8 8 7 6 6 6 6 6 6 6 6 6 6 6 6 6 1 1 1 1 1 1 1 1 1 1 1 1 1 1 1 1 1
symmnumber: 1
zpe: 734116.0 jmol-1
zpe.correction: 0.279610 hartree
zpe.thermalcorrener: 0.298245 hartree
zpe.thermalcorrenthalpy: 0.299189 hartree
zpe.thermalcorrgfe: 0.231494 hartree
zpe.sumelectzpe: -859.804245 hartree
zpe.sumelectthermal: -859.785610 hartree
zpe.sumelectthermalent: -859.784666 hartree
zpe.sumelectthermalfe: -859.852361 hartree
dipole: -5.9737 1.0599 -0.1724
dipole: 6.0695
quadrupole: -129.6660 -107.4505 -105.4513
quadrupole: -7.8873 1.8188 0.1895
quadrupole: -15.4767 6.7388 8.7379 -7.8873 1.8188 0.1895
hfenergy: -860.083855 hartree
pointgroup: C01 [X(C13H17N1O4)]
dipole: 2.354201 0.3146055 0.2467659 debye
polarizability: 249.6362856|-2.2511806|136.2644558|-1.766956|27.3013069|126.8547611 unknown
InChI: InChI=1S/C13H17NO4/c1-4-13(3,5-2)18-12(15)10-6-8-11(9-7-10)14(16)17/h6-9H,4-5H2,1-3H3
charge 0 multiplicity 1
35 atoms
O  1.672902 0.320404 0.32328
O  1.352291 -1.446568 -1.193825
O  -5.574247 -0.576592 -0.284671
O  -5.165919 1.131634 1.170323
N  -4.775322 0.202692 0.363555
C  3.211666 0.291008 0.291731
C  3.65254 -1.07618 0.882356
C  3.713797 0.505603 -1.160322
C  3.556528 1.46647 1.221081
C  5.176257 -1.212585 1.105121
C  3.166411 1.761165 -1.871722
C  0.908168 -0.559029 -0.420639
C  -0.560816 -0.326685 -0.192922
C  -1.477704 -1.159041 -0.885992
C  -1.037791 0.682338 0.68366
C  -2.863087 -0.992051 -0.709651
C  -2.421428 0.861141 0.869918
C  -3.312342 0.018732 0.168914
H  3.129758 -1.21032 1.849726
H  3.308194 -1.880353 0.208419
H  3.471543 -0.393484 -1.753158
H  4.818221 0.57064 -1.106335
H  3.047455 2.387438 0.89225
H  4.644262 1.653077 1.214546
H  3.243177 1.248793 2.256966
H  5.56314 -0.456057 1.810989
H  5.403123 -2.207451 1.528617
H  5.739739 -1.122147 0.159089
H  3.473678 2.694651 -1.366938
H  3.544668 1.803422 -2.908808
H  2.063012 1.748753 -1.919068
H  -1.081089 -1.928752 -1.555082
H  -0.317545 1.313795 1.209236
H  -3.592668 -1.618185 -1.229243
H  -2.820572 1.628425 1.537997
