program: Gaussian 09
title: 000276038
version: EM64L-G09RevD.01
frameworkgroup: C1[X(C14H19N3O2)]
method: RPBEPBE
basis: SDD
operation: Freq
keyword: #p
keyword: freq=noraman
keyword: PBEPBE/SDD
title: #p freq=noraman PBEPBE/SDD
converged: YES YES NO NO
title: Mulliken charges:
elementType: O O N N N C C C C C C C C C C C C C C H H H H H H H H H H H H H H H H H H H
charge: -0.316202 -0.243501 -0.149096 0.022089 -0.383310 0.403578 -0.356132 -0.366369 0.538573 -0.409420 -0.429274 -0.645567 -0.646625 -0.336913 -0.208735 -0.284575 -0.257272 -0.661212 0.318903 0.237279 0.236596 0.225986 0.222150 0.236027 0.236339 0.218175 0.217974 0.237240 0.237046 0.212999 0.247667 0.199929 0.218172 0.236488 0.213193 0.252703 0.222407 0.302692
chargesum: 0.00000
title: Mulliken charges with hydrogens summed into heavy atoms:
elementType: O O N N N C C C C C C C C C C C C C C
charge: -0.316202 -0.243501 -0.149096 0.022089 -0.080617 0.403578 -0.118853 -0.129774 0.538573 -0.183434 -0.207124 0.044974 0.045634 -0.123914 0.038932 -0.084646 0.197387 0.027090 0.318903
polarizability: 5.63292430e+02 1.87562859e+00 1.68989914e+02 -7.44819618e+00 -2.52326183e+00 9.47000621e+01
1716.lowfreq: -0.0012 -0.0009 0.0017 0.8226 5.6532 14.2837 21.8252 28.7355 36.8151
frequency: 21.8139 28.7187 36.7236 47.5719 69.4261 75.1259 86.7148 104.7480 108.4363 139.0234 153.6637 175.2077 192.7204 197.9639 209.7962 225.5846 274.8986 283.5530 313.9042 337.6141 348.3813 394.9436 407.3710 428.0560 429.4756 467.4441 482.4722 526.1453 557.5788 592.3657 632.3316 637.4532 665.7694 684.2198 718.7708 738.5100 802.9567 803.7421 819.4748 830.8518 854.4254 873.2033 917.1587 943.2501 946.6584 953.3065 957.8242 987.7702 995.6446 1017.3326 1057.2450 1092.7282 1095.1905 1107.2974 1110.4270 1130.1581 1149.4525 1164.3885 1167.1612 1193.1823 1209.2149 1244.2579 1259.8315 1270.9469 1282.8829 1290.3780 1322.6622 1341.5003 1359.0019 1367.4649 1383.3004 1389.6782 1430.3742 1449.6594 1455.9345 1460.1317 1462.8192 1464.0336 1476.3727 1484.1154 1492.5842 1502.7458 1506.8157 1525.2877 1550.6037 1564.8075 1620.3624 1641.4557 1691.4510 2941.8219 2949.4202 2957.7448 2990.6059 3007.7135 3011.6389 3025.5067 3070.8059 3085.4964 3089.4597 3098.7920 3107.8519 3115.0541 3115.7555 3132.7573 3138.2501 3162.5187 3167.1367 3403.6240
redmass: 4.2147 3.8426 4.2448 4.1682 3.6380 2.4404 4.4690 3.9659 1.9108 2.4011 2.6891 5.3549 2.1833 1.1806 2.3442 1.7130 2.7932 2.8885 3.3751 3.3732 4.4812 3.9539 3.7338 4.1886 3.3416 3.5784 3.5151 2.1872 4.1482 4.4582 1.1824 6.7714 4.3887 11.7101 4.6947 3.2212 1.1974 1.2893 1.6870 4.4448 3.9388 1.8087 1.5018 3.1236 1.4006 4.6458 1.3603 1.1574 2.8906 3.5685 1.4991 8.8063 2.1799 1.2383 1.3226 1.6477 1.9597 2.2354 1.7034 1.5435 1.3158 1.3496 2.8310 1.8435 1.1078 1.6185 1.5797 1.5209 1.2774 3.2268 3.7862 1.2364 1.2501 2.6753 1.0893 1.2384 1.0463 1.0412 1.0457 1.0532 1.1123 1.5520 1.2995 2.5505 5.9844 5.3396 5.2762 5.6984 10.0073 1.0370 1.0395 1.0872 1.0361 1.0998 1.1024 1.0596 1.0889 1.0976 1.1033 1.0959 1.0941 1.0894 1.1053 1.0892 1.0886 1.0931 1.0945 1.0750
irintensity: 1.8005 1.4869 3.3574 0.3368 6.8971 0.5968 3.1057 1.4456 2.2644 0.1617 6.9800 1.1487 12.0427 0.3642 0.0344 1.9614 17.2135 12.5657 11.5937 4.2181 6.7434 3.1039 0.5864 2.7158 0.2733 3.1639 4.3028 20.3164 12.0238 0.7943 81.1970 0.3174 19.0627 26.1237 8.2605 0.1804 4.1849 5.7684 77.6123 4.3473 1.9442 0.7210 0.7685 36.3885 4.7190 228.6369 0.3124 88.2838 0.9004 363.1634 26.1402 143.0704 142.2739 0.0090 1.1747 20.8607 567.9074 296.6046 34.9695 277.9961 5.4323 15.6468 31.2081 3.9786 6.1701 8.0790 52.8990 17.3415 1.9034 296.3210 6.5638 30.2006 7.5759 9.7101 19.8311 27.0384 11.0005 0.6151 22.1320 7.6628 8.6835 407.9169 33.3007 348.0278 2.9047 65.8848 717.6870 61.9895 604.4634 107.6994 200.9612 67.2336 28.3654 15.7063 71.1987 51.2282 24.6276 48.2964 2.8532 4.3663 52.3756 12.5337 41.0156 17.4791 6.9280 28.9321 19.8951 6.1401
temp: 298.150 k
press: 1.00000 atm
elementType: 8 8 7 7 7 6 6 6 6 6 6 6 6 6 6 6 6 6 6 1 1 1 1 1 1 1 1 1 1 1 1 1 1 1 1 1 1 1
symmnumber: 1
zpe: 812491.4 jmol-1
zpe.correction: 0.309462 hartree
zpe.thermalcorrener: 0.329852 hartree
zpe.thermalcorrenthalpy: 0.330796 hartree
zpe.thermalcorrgfe: 0.257954 hartree
zpe.sumelectzpe: -858.126561 hartree
zpe.sumelectthermal: -858.106171 hartree
zpe.sumelectthermalent: -858.105226 hartree
zpe.sumelectthermalfe: -858.178069 hartree
dipole: -5.3949 -2.8788 0.5029
dipole: 6.1356
quadrupole: -56.8236 -107.1036 -118.8907
quadrupole: -16.9894 0.9274 0.3660
quadrupole: 37.4491 -12.8310 -24.6181 -16.9894 0.9274 0.3660
hfenergy: -858.4360224 hartree
pointgroup: C01 [X(C14H19N3O2)]
dipole: 2.1352469 1.118857 -0.1259908 debye
polarizability: 563.2160335|-0.0601372|164.0311582|9.7149482|-18.7132767|99.7352146 unknown
InChI: InChI=1S/C14H19N3O2/c1-4-19-14(18)16-15-11-5-6-12-7-9-13(10-8-12)17(2)3/h5-11,16H,4H2,1-3H3
charge 0 multiplicity 1
38 atoms
O  -6.337285 0.598894 -0.531095
O  -5.355639 -1.472842 0.061881
N  6.19876 -0.440799 0.185269
N  -2.84772 -0.083719 -0.208274
N  -4.095437 0.488395 -0.401163
C  4.851179 -0.100269 0.05132
C  3.813509 -1.068509 0.267755
C  4.448168 1.226959 -0.30688
C  2.053217 0.595799 -0.225345
C  2.462669 -0.724658 0.132133
C  3.089805 1.55186 -0.438316
C  7.238271 0.572642 -0.03572
C  6.581248 -1.808368 0.561101
C  0.658234 0.998606 -0.376866
C  -0.463338 0.214112 -0.206835
C  -1.804655 0.717712 -0.38381
C  -7.68731 -0.008971 -0.378053
C  -8.157271 0.048338 1.078693
C  -5.253785 -0.268568 -0.249676
H  4.068973 -2.095298 0.544225
H  5.196931 2.004475 -0.481429
H  1.706995 -1.498579 0.307589
H  2.815454 2.578459 -0.713965
H  7.142685 1.421676 0.671545
H  7.200738 0.981335 -1.065952
H  8.230665 0.118724 0.111902
H  7.678893 -1.88061 0.612841
H  6.226567 -2.552996 -0.180013
H  6.174163 -2.092732 1.552586
H  0.500424 2.051989 -0.658994
H  -0.387786 -0.843092 0.074022
H  -1.918644 1.785277 -0.66958
H  -8.322989 0.599139 -1.042079
H  -7.647162 -1.050859 -0.74243
H  -9.192609 -0.334013 1.153094
H  -7.512585 -0.576536 1.719265
H  -8.143861 1.085295 1.457114
H  -4.215371 1.476634 -0.667964
