program: Gaussian 09
title: 000276011
version: EM64L-G09RevD.01
frameworkgroup: C1[X(C11H14N2O2)]
method: RPBEPBE
basis: SDD
operation: Freq
keyword: #p
keyword: freq=noraman
keyword: PBEPBE/SDD
title: #p freq=noraman PBEPBE/SDD
converged: NO YES NO NO
title: Mulliken charges:
elementType: O O N N C C C C C C C C C C C H H H H H H H H H H H H H H
charge: -0.312715 -0.235736 0.033029 -0.390517 0.325377 0.288908 -0.408612 -0.356658 -0.829236 -0.226927 -0.239264 -0.388042 -0.220959 -0.673052 0.315418 0.228980 0.282080 0.229983 0.234664 0.229973 0.228195 0.230762 0.217831 0.230179 0.230210 0.213671 0.228890 0.228896 0.304671
chargesum: 0.00000
title: Mulliken charges with hydrogens summed into heavy atoms:
elementType: O O N N C C C C C C C C C C C
charge: -0.312715 -0.235736 0.033029 -0.085846 0.325377 0.288908 -0.179632 -0.074578 -0.134616 0.001268 -0.008502 -0.170212 0.239430 -0.001595 0.315418
polarizability: 2.76553344e+02 -1.05271100e+00 1.45859831e+02 5.25103969e-02 -1.78846253e-02 7.07020304e+01
1716.lowfreq: -34.3167 -2.2326 -0.0003 0.0004 0.0008 3.0122 9.6895 43.5119 49.5681
frequency: -29.7845 43.5027 49.5607 52.8803 100.6370 132.7224 150.5920 158.8716 192.5796 206.0713 236.3179 248.7449 251.8615 323.7621 348.4165 368.7647 431.1184 459.2580 509.6012 532.9664 542.3150 629.0187 639.8862 688.7323 703.2475 731.0776 772.1377 783.5609 798.3525 835.7298 863.9655 885.5388 935.4734 967.0975 983.4792 988.1247 1002.4999 1029.8035 1044.3284 1046.7336 1089.0675 1109.3580 1125.2905 1139.6854 1164.1767 1174.8661 1199.3519 1249.5954 1250.6117 1294.6789 1337.3992 1358.9182 1385.1091 1398.0255 1400.9740 1436.6640 1463.1293 1471.6815 1476.5371 1477.6332 1485.2973 1489.2877 1512.1165 1565.3466 1588.3828 1614.6663 1689.8112 2973.2684 2995.7558 3000.6196 3008.7650 3049.1775 3066.4849 3085.9095 3092.7104 3107.0228 3121.4166 3136.4014 3152.6545 3167.5926 3401.8712
redmass: 2.2893 4.0271 4.4848 5.2923 3.2481 4.4192 3.7332 1.0787 3.2204 4.9589 2.9967 1.2136 5.6076 4.0796 3.6930 3.9388 4.1525 2.8566 5.6294 3.2289 5.3539 6.1473 1.1874 11.0284 6.7817 2.4518 1.3920 4.8764 1.0946 4.0145 3.8321 1.3046 1.5058 1.3934 3.3839 1.9879 1.3429 2.7242 1.5518 2.1085 3.9662 2.2151 2.7943 1.4698 2.5399 1.0710 2.1280 1.1281 2.2071 1.5167 1.6280 1.4262 3.2621 1.2678 1.3020 2.1758 1.0409 1.9548 1.0679 1.0459 1.2469 1.1101 1.9126 6.3882 5.6177 6.2318 10.6550 1.0385 1.0357 1.0860 1.0581 1.0977 1.1068 1.0974 1.0985 1.1026 1.0867 1.0894 1.0943 1.0999 1.0751
irintensity: 0.0000 0.1592 1.0855 7.2288 2.2994 5.9765 1.3508 2.7646 0.0716 0.7583 26.3596 1.3636 9.6413 0.1626 9.3250 4.7379 7.7524 8.8929 2.4493 0.1545 0.1774 4.0167 84.7131 27.6165 7.3439 20.1338 53.0437 6.1343 4.0626 4.1953 12.9271 0.2387 30.1951 5.0199 134.8510 47.8529 0.8465 187.8792 7.1253 29.4075 90.2213 73.8631 107.2798 5.0509 646.2520 0.3567 35.2790 0.0161 18.6067 3.8857 35.3918 2.9311 14.9779 32.6652 7.0675 9.9211 12.0390 38.1639 15.8175 13.6153 46.3914 12.6499 313.2685 8.8216 0.0041 8.2229 400.1387 23.4267 23.6803 58.9154 27.4618 21.4314 8.9762 23.2389 32.5232 47.2646 9.6213 16.0636 19.9980 24.3192 5.4787
temp: 298.150 k
press: 1.00000 atm
elementType: 8 8 7 7 6 6 6 6 6 6 6 6 6 6 6 1 1 1 1 1 1 1 1 1 1 1 1 1 1
symmnumber: 1
zpe: 609955.8 jmol-1
zpe.correction: 0.232320 hartree
zpe.thermalcorrener: 0.246822 hartree
zpe.thermalcorrenthalpy: 0.247766 hartree
zpe.thermalcorrgfe: 0.189885 hartree
zpe.sumelectzpe: -686.386043 hartree
zpe.sumelectthermal: -686.371542 hartree
zpe.sumelectthermalent: -686.370597 hartree
zpe.sumelectthermalfe: -686.428478 hartree
dipole: -0.2672 4.0027 0.0012
dipole: 4.0116
quadrupole: -65.5894 -86.3069 -91.8691
quadrupole: -3.4474 -0.0069 -0.0074
quadrupole: 15.6658 -5.0518 -10.6140 -3.4474 -0.0069 -0.0074
hfenergy: -686.6183633 hartree
pointgroup: C01 [X(C11H14N2O2)]
dipole: 0.1190458 -1.5737769 0.0011811 debye
polarizability: 276.5617001|0.1018332|145.8514317|-0.108082|-0.0179822|70.7020739 unknown
InChI: InChI=1S/C11H14N2O2/c1-3-15-11(14)13-12-8-10-7-5-4-6-9(10)2/h4-8,13H,3H2,1-2H3
charge 0 multiplicity 1
29 atoms
O  3.934424 -0.402653 -0.003212
O  2.864015 1.703945 -0.003515
N  0.42419 0.195749 -0.00312
N  1.686324 -0.361133 -0.004467
C  -3.085284 -1.044999 0.00059
C  -1.979885 -0.133036 -0.000758
C  -4.398116 -0.511895 0.001676
C  -2.223499 1.271447 -0.000976
C  -2.890976 -2.55452 0.000905
C  -4.631776 0.880876 0.001445
C  -3.535294 1.7767 0.00011
C  -0.598937 -0.637318 -0.00192
C  5.255186 0.288359 -0.000525
C  6.322465 -0.801097 0.001036
C  2.816872 0.457905 -0.005497
H  -5.249992 -1.202366 0.002713
H  -1.359347 1.943452 -0.002023
H  -2.334289 -2.901243 0.892307
H  -3.866249 -3.069253 0.0020
H  -2.335979 -2.901835 -0.891319
H  -5.658543 1.263304 0.002297
H  -3.706548 2.858592 -0.000079
H  -0.451208 -1.734297 -0.001873
H  5.313064 0.935002 -0.894859
H  5.30982 0.93437 0.89447
H  7.326201 -0.338442 0.003028
H  6.233795 -1.440247 0.896069
H  6.237052 -1.439594 -0.89478
H  1.842814 -1.37997 -0.004424
