program: Gaussian 09
title: 000276015
version: EM64L-G09RevD.01
frameworkgroup: C1[X(C10H11IN2O2)]
method: RPBEPBE
basis: SDD
operation: Freq
keyword: #p
keyword: freq=noraman
keyword: PBEPBE/SDD
title: #p freq=noraman PBEPBE/SDD
converged: YES YES NO NO
title: Mulliken charges:
elementType: I O O N N C C C C C C C C C C H H H H H H H H H H H
charge: 0.097312 -0.310413 -0.229931 -0.389124 0.039660 0.454551 -0.281734 -0.385868 -0.324124 -0.209062 -0.183483 -0.222185 -0.377702 -0.672072 0.321259 0.298873 0.228556 0.235574 0.231860 0.231856 0.253470 0.210802 0.215091 0.229419 0.229420 0.307994
chargesum: 0.00000
title: Mulliken charges with hydrogens summed into heavy atoms:
elementType: I O O N N C C C C C C C C C C
charge: 0.097312 -0.310413 -0.229931 -0.081130 0.039660 0.454551 0.017139 -0.157312 -0.324124 0.026512 0.069987 0.241532 -0.166900 0.001857 0.321259
polarizability: 2.84392936e+02 -1.16151158e+01 1.82885499e+02 -2.56031617e-04 2.08507239e-03 6.38296521e+01
1716.lowfreq: -4.7282 -0.0010 -0.0006 0.0003 0.6602 5.5578 17.7789 32.2294 44.2648
frequency: 17.4653 32.2229 44.2381 55.5558 94.7491 103.7331 145.3744 167.0389 182.6582 237.2449 239.4579 253.5436 258.6050 272.9513 312.8263 350.7573 424.1502 436.5751 504.0352 552.3715 631.1408 639.0801 651.6804 688.6961 693.4924 709.1529 788.0863 800.0976 842.3583 878.2777 901.4189 923.7916 946.5752 978.5362 981.3242 985.1126 1030.0258 1059.7964 1089.5728 1106.0488 1123.0272 1139.8512 1162.8285 1181.7793 1230.9886 1250.7719 1283.9101 1335.1982 1359.6154 1377.5317 1400.5597 1415.9092 1454.3966 1463.9616 1476.7136 1488.9659 1508.6916 1553.4188 1590.2038 1597.4554 1690.7463 2976.2922 2996.1233 3009.8873 3068.3023 3093.5729 3107.3501 3124.8483 3150.4169 3171.7676 3175.2695 3405.9133
redmass: 2.9398 7.6449 4.6746 3.7535 6.0363 3.3079 4.5370 4.6301 5.9039 2.9129 8.1693 1.1909 5.5825 6.6543 4.7441 3.9475 4.9483 3.1485 6.2416 4.3577 6.6245 1.2095 6.8433 3.9567 3.1972 6.9456 1.4505 1.0958 3.9041 4.9878 1.3685 1.3840 1.5914 6.1126 1.3580 5.5511 2.6839 2.2130 2.1743 2.5449 3.1209 1.4648 2.8466 1.0831 1.9095 1.1295 1.2692 1.5750 1.4186 5.2513 1.2671 2.7469 2.2671 1.0406 1.0613 1.0925 1.8505 6.6645 6.2343 6.4920 10.5363 1.0873 1.0357 1.0582 1.1069 1.0985 1.1028 1.0882 1.0924 1.0932 1.0972 1.0752
irintensity: 1.1995 0.4845 0.6950 6.7632 0.9032 1.7362 6.1251 0.7416 10.2879 21.4740 4.0878 0.2106 0.7846 3.1078 2.9370 7.7137 10.8725 7.3440 1.9668 1.1389 1.1095 79.4436 33.0129 0.0148 69.9060 26.3816 37.1047 4.1625 3.5734 18.8241 5.5731 1.5412 45.9925 36.1620 1.3678 168.0414 195.8103 19.0803 52.9540 158.6082 85.6130 5.1787 712.8496 0.3413 63.2406 0.0097 7.8233 24.2952 5.0006 0.8875 31.2240 32.3152 66.1131 12.2829 18.7105 24.0653 352.1800 59.5552 23.1109 6.3421 331.7387 66.3905 23.6586 24.2725 7.9132 30.8452 46.4725 9.4873 15.4129 0.1985 12.1239 4.1957
temp: 298.150 k
press: 1.00000 atm
elementType: 53 8 8 7 7 6 6 6 6 6 6 6 6 6 6 1 1 1 1 1 1 1 1 1 1 1
symmnumber: 1
zpe: 510662.4 jmol-1
zpe.correction: 0.194501 hartree
zpe.thermalcorrener: 0.209888 hartree
zpe.thermalcorrenthalpy: 0.210832 hartree
zpe.thermalcorrgfe: 0.147615 hartree
zpe.sumelectzpe: -657.994296 hartree
zpe.sumelectthermal: -657.978909 hartree
zpe.sumelectthermalent: -657.977965 hartree
zpe.sumelectthermalfe: -658.041182 hartree
dipole: 3.0523 4.5503 0.0003
dipole: 5.4792
quadrupole: -74.2228 -91.4858 -105.9493
quadrupole: -0.1265 0.0005 -0.0002
quadrupole: 16.3299 -0.9332 -15.3967 -0.1265 0.0005 -0.0002
hfenergy: -658.1887966 hartree
pointgroup: C01 [X(C10H11I1N2O2)]
dipole: 0.7614471 -2.0167389 0.0006113 debye
dipolederiv: -0.1073646 0.1507485 -0.0000285 0.2562222 -0.480166 0.0001901 -0.0001351 0.0002049 -0.0078591 -2.4196911 0.0461077 0.0001892 0.3264327 -0.506917 0.0000371 0.0000857 0.00013 -0.3109713 -0.7326108 0.0014826 0.0000321 -0.4224323 -0.9766731 0.0002758 0.0002115 0.0001305 -0.3207956 -2.3573538 -0.4868635 0.0003592 -0.3425032 -0.2539151 0.0000151 0.0003712 -0.0000564 -0.3273959 1.324969 0.2165953 -0.0002284 -0.4700175 -0.2788663 0.000101 -0.0000136 0.000004 -0.0837793 0.2827501 0.0941134 -0.0000562 -0.0638244 0.0332187 0.0000114 -0.0000212 0.0000204 0.0420525 -0.2553273 0.1592831 -0.0000456 0.3400957 -0.4099769 0.0001104 -0.0001027 0.0000898 -0.0789773 -0.1994363 -0.0598918 0.0000284 0.009483 0.0185779 -0.0000717 -0.0000453 0.0000127 -0.1860561 0.1769618 -0.4234089 0.0001392 -0.6870156 1.154852 -0.0004854 0.0002584 -0.000441 -0.1520744 0.1635014 -0.0299556 -0.0000087 0.1609997 0.0651885 -0.0000816 -0.0000225 -0.0002123 -0.1314985 -0.1639724 0.1567937 -0.000062 0.1369306 -0.4183056 0.0000991 -0.0001062 0.0002535 -0.1131504 1.2281089 0.0812214 -0.000106 0.3727317 0.2757388 -0.0000059 -0.0002002 -0.0000369 0.3555146 0.0358535 -0.1403766 0.0000376 -0.4965576 0.335469 -0.0001056 0.0001679 -0.0000265 -0.1176745 -0.1504989 0.0674272 0.0000058 0.0262271 0.0136645 -0.0000011 0.0000801 -0.0001519 0.0655191 3.1179625 0.2138634 -0.0003293 0.9233985 1.5094288 -0.0005141 -0.0006282 -0.0003387 0.32018 0.1091342 -0.0743096 0.0000224 -0.0564816 0.0673765 0.0000312 0.0000655 -0.0000641 0.1561847 0.0729217 0.0958946 -0.0000284 0.0625933 -0.0931359 0.0000908 -0.0000372 0.0001281 0.1614936 -0.0295682 -0.0848377 0.0000443 -0.0966916 -0.0516267 0.0000872 0.0000623 0.0000581 0.1620584 -0.068271 0.0187131 -0.0311206 -0.0903003 -0.005624 0.0872287 0.0083956 0.1039417 -0.060729 -0.0682861 0.0186844 0.0311049 -0.0903263 -0.0057156 -0.0872456 -0.0083495 -0.1039611 -0.0606592 -0.0509566 0.0263967 0.0000019 0.044958 0.10111 0.0000178 0.0000318 -0.0000517 0.1657277 -0.0497034 0.0799919 -0.0000038 0.111038 -0.177909 0.0001233 -0.0000137 0.0000885 0.1856842 -0.1381619 -0.0864408 0.0000617 -0.1139014 0.0191695 0.0000459 0.0000494 0.0000682 0.117288 0.1189558 -0.0063751 0.0210378 0.0571856 0.008883 0.108147 -0.0111486 0.1175311 -0.0646863 0.1189535 -0.006402 -0.0210883 0.0571425 0.0088044 -0.1081975 0.0110273 -0.1174525 -0.0645753 0.0411301 -0.0284555 0.0000412 0.0446131 0.0473496 0.0000965 0.0000171 0.0001318 0.3491796 unknown
polarizability: 284.2775382|-12.1083144|183.0008782|-0.014451|-0.0438559|63.8296698 unknown
InChI: InChI=1S/C10H11IN2O2/c1-2-15-10(14)13-12-7-8-4-3-5-9(11)6-8/h3-7,13H,2H2,1H3
charge 0 multiplicity 1
26 atoms
I  -4.274515 2.918306 -0.001315
O  4.072995 -0.317942 -0.000799
O  2.732831 1.627541 -0.001274
N  1.839477 -0.575552 -0.000472
N  0.520342 -0.186169 -0.00045
C  -1.82644 -0.786873 -0.000038
C  -2.254406 0.573532 -0.000524
C  -2.796931 -1.824521 0.000433
C  -3.628985 0.860108 -0.000522
C  -4.172666 -1.512592 0.000437
C  -4.604679 -0.166312 -0.00004
C  5.294084 0.539382 -0.001169
C  -0.39803 -1.129908 -0.000019
C  6.49291 -0.402994 -0.001116
C  2.8552 0.387744 -0.000909
H  -1.496123 1.361282 -0.000888
H  -2.472903 -2.872426 0.0008
H  -4.918825 -2.314198 0.000806
H  5.26475 1.186627 -0.896304
H  5.264999 1.187043 0.893673
H  -5.671366 0.074673 -0.000037
H  -0.144458 -2.209593 0.000315
H  7.42791 0.186175 -0.001391
H  6.48955 -1.047318 0.894632
H  6.489292 -1.047743 -0.896557
H  2.128485 -1.564769 -0.000177
