program: Gaussian 09
title: 000276001
version: EM64L-G09RevD.01
frameworkgroup: C1[X(C14H20N2O4)]
method: RPBEPBE
basis: SDD
operation: Freq
keyword: #p
keyword: freq=noraman
keyword: PBEPBE/SDD
title: #p freq=noraman PBEPBE/SDD
converged: YES YES NO NO
title: Mulliken charges:
elementType: O O O O N N C C C C C C C C C C C C C C H H H H H H H H H H H H H H H H H H H H
charge: -0.244236 -0.231199 -0.314356 -0.243329 0.020562 -0.387678 0.223652 0.203798 0.505596 -0.512623 -0.341131 -0.440140 -0.241600 -0.245177 -0.402575 -0.685719 -0.682824 -0.220256 0.314122 -0.673528 0.301766 0.247235 0.221683 0.214640 0.214637 0.208345 0.208422 0.207541 0.207500 0.231224 0.231151 0.204377 0.234692 0.234778 0.228600 0.228553 0.304014 0.212328 0.228572 0.228581
chargesum: 0.00000
title: Mulliken charges with hydrogens summed into heavy atoms:
elementType: O O O O N N C C C C C C C C C C C C C C
charge: -0.244236 -0.231199 -0.314356 -0.243329 0.020562 -0.083664 0.223652 0.203798 0.505596 -0.210858 -0.093896 -0.218458 0.187678 0.171591 -0.195034 -0.015843 -0.008977 0.236897 0.314122 -0.004046
polarizability: 3.73255244e+02 1.41995049e+01 1.98848242e+02 1.05094275e-02 4.82803333e-02 1.01774047e+02
1716.lowfreq: -5.0589 -3.3096 -0.0011 -0.0003 0.0007 8.1169 21.5190 32.3097 38.1898
frequency: 21.4887 32.2880 38.0884 53.6988 65.7438 72.6280 90.7740 96.0995 105.4861 114.1894 124.0451 143.8674 154.1207 198.9272 223.4557 229.1506 236.7249 240.9448 246.3384 246.7548 289.5591 307.3124 317.5858 340.6359 368.4499 407.7607 409.6852 467.7102 498.6638 531.8255 583.5741 621.3374 634.5333 635.8211 686.3479 694.1249 744.5695 745.6575 759.5102 793.8154 802.5031 828.7931 829.7305 848.8377 875.2777 899.3290 900.1084 910.4127 945.4570 968.5232 1005.7012 1029.5814 1031.7950 1033.5327 1094.7046 1113.9078 1116.2751 1116.9193 1131.9515 1133.4827 1135.2063 1140.2251 1160.2692 1183.1589 1222.9359 1250.7572 1259.5999 1260.8383 1268.2553 1277.1206 1337.1705 1360.5306 1362.7148 1372.4164 1396.0316 1399.6049 1400.8280 1407.0620 1432.9663 1460.1347 1460.5947 1463.1195 1473.7408 1476.9155 1477.3957 1485.4206 1488.2811 1490.1071 1499.6861 1515.3915 1567.1777 1595.9124 1606.8793 1688.6201 2952.2262 2962.2637 2969.8382 2996.1683 2997.7112 2997.9179 3008.2416 3011.3732 3021.2725 3065.9913 3093.2380 3094.8840 3095.3654 3106.8970 3106.9821 3108.6151 3127.5819 3166.4417 3174.6950 3408.7946
redmass: 4.0763 4.6513 4.2625 4.4520 2.4673 3.4402 3.6325 2.8962 4.2552 1.7229 1.8081 4.7549 4.5100 4.8258 4.6513 2.6484 4.8641 1.3088 1.2203 1.2152 5.8303 4.3291 4.3690 3.9712 3.5639 5.1750 5.0477 3.1353 5.3228 5.4744 5.8600 1.9472 1.6677 5.8481 11.4983 6.6628 3.1408 4.7851 4.5666 1.4452 1.0949 1.1060 1.1188 3.5698 3.3660 1.4262 3.3971 1.3668 1.5752 5.4255 3.2342 2.7160 2.7204 2.6000 6.4056 2.2645 2.3234 2.4183 2.1604 1.4334 1.4426 1.4616 2.5433 2.1606 1.9840 1.1310 1.1468 3.1547 1.1363 1.3362 1.6457 1.3652 1.3487 1.4034 1.5883 1.2685 1.2688 2.3225 5.1237 1.0398 1.0397 1.0403 1.1759 1.0666 1.0590 1.1602 1.0985 1.0941 1.6160 2.2620 7.6349 6.1949 6.2024 10.7887 1.0551 1.0557 1.0870 1.0357 1.0363 1.0362 1.0582 1.1075 1.1075 1.1069 1.0985 1.0988 1.0989 1.1024 1.1014 1.1014 1.0891 1.0936 1.0911 1.0752
irintensity: 0.0967 1.1759 3.7983 4.5000 3.0262 3.0570 2.8204 5.0689 0.1499 2.0751 0.0030 1.4729 3.8564 0.9188 6.9072 13.0813 7.8657 0.2023 0.1192 0.0782 11.4122 2.5380 3.3225 5.8320 0.4233 0.2036 12.3428 1.8371 6.8902 5.5811 4.7603 8.8270 91.5198 22.1786 27.0459 2.5984 0.4048 30.4955 1.1093 40.4622 4.1690 8.0258 0.9832 5.0409 19.5755 4.5930 39.0948 12.1378 40.1041 171.0731 128.4006 174.5247 170.6351 26.6486 204.2795 2.1101 4.2616 1.3757 190.3565 4.5329 5.3173 4.9811 668.8326 297.2129 50.1693 0.0428 0.3178 385.3683 0.0144 0.4258 45.2896 19.7520 10.9983 7.5934 63.4573 10.3739 21.5832 8.2890 55.0033 4.0789 19.5284 11.8342 141.0362 16.0360 15.4451 116.6289 29.2311 11.6313 253.4584 74.7704 22.9346 8.2934 103.9145 417.7482 50.0247 25.3469 70.0836 27.0379 24.1030 30.2779 29.5295 35.7210 30.6296 9.8283 33.8326 43.9543 11.2814 29.9496 49.3673 35.8677 14.9045 20.9023 5.0858 7.8348
temp: 298.150 k
press: 1.00000 atm
elementType: 8 8 8 8 7 7 6 6 6 6 6 6 6 6 6 6 6 6 6 6 1 1 1 1 1 1 1 1 1 1 1 1 1 1 1 1 1 1 1 1
symmnumber: 1
zpe: 849550.1 jmol-1
zpe.correction: 0.323577 hartree
zpe.thermalcorrener: 0.345551 hartree
zpe.thermalcorrenthalpy: 0.346495 hartree
zpe.thermalcorrgfe: 0.270332 hartree
zpe.sumelectzpe: -954.317663 hartree
zpe.sumelectthermal: -954.295688 hartree
zpe.sumelectthermalent: -954.294744 hartree
zpe.sumelectthermalfe: -954.370908 hartree
dipole: -0.1242 -3.5493 0.0068
dipole: 3.5515
quadrupole: -87.8586 -105.2342 -121.0869
quadrupole: 0.9431 -0.0515 -0.0092
quadrupole: 16.8680 -0.5077 -16.3603 0.9431 -0.0515 -0.0092
hfenergy: -954.6412395 hartree
pointgroup: C01 [X(C14H20N2O4)]
dipole: -0.020226 -1.3961906 0.05106 debye
polarizability: 372.4558562|17.5255712|199.3623177|-6.8811545|-3.7088247|102.0593597 unknown
InChI: InChI=1S/C14H20N2O4/c1-4-18-12-8-7-11(9-13(12)19-5-2)10-15-16-14(17)20-6-3/h7-10,16H,4-6H2,1-3H3
charge 0 multiplicity 1
40 atoms
O  -2.904239 1.728792 0.201566
O  -4.548057 -0.341827 0.312861
O  5.489946 -0.244349 0.080074
O  4.053139 1.632904 0.048494
N  1.925634 -0.291468 0.159974
N  3.271898 -0.60972 0.140833
C  -2.292189 0.474186 0.2298
C  -3.187901 -0.651113 0.289966
C  -0.371809 -1.064243 0.237115
C  -0.904938 0.258351 0.204206
C  -2.655575 -1.959395 0.32192
C  -1.25855 -2.165189 0.295593
C  -2.019538 2.912973 0.140496
C  -5.505896 -1.465121 0.37964
C  1.073017 -1.296647 0.212109
C  -2.92984 4.137152 0.122809
C  -6.901048 -0.847304 0.39659
C  6.660776 0.674075 0.022658
C  4.231942 0.398237 0.08601
C  7.907704 -0.204868 0.021676
H  -0.195352 1.088431 0.159066
H  -3.323165 -2.824071 0.3678
H  -0.861683 -3.187046 0.32134
H  -1.349517 2.917114 1.024342
H  -1.394424 2.857692 -0.773995
H  -5.364703 -2.122303 -0.503314
H  -5.313873 -2.057999 1.297783
H  1.405652 -2.355045 0.239779
H  -2.321863 5.058908 0.075217
H  -3.599355 4.111564 -0.753696
H  -3.55215 4.172589 1.033084
H  -7.667972 -1.641899 0.443746
H  -7.022797 -0.187882 1.272386
H  -7.070634 -0.247832 -0.513672
H  6.579171 1.290854 -0.890829
H  6.62145 1.348785 0.897149
H  3.610533 -1.582431 0.165992
H  8.811317 0.430114 -0.021477
H  7.958371 -0.819066 0.937042
H  7.914716 -0.878605 -0.852233
