program: Gaussian 09
title: 000275971
version: EM64L-G09RevD.01
frameworkgroup: C1[X(C7H13N3O4)]
method: RPBEPBE
basis: SDD
operation: Freq
keyword: #p
keyword: freq=noraman
keyword: PBEPBE/SDD
title: #p freq=noraman PBEPBE/SDD
converged: YES YES NO NO
title: Mulliken charges:
elementType: O O O O N N N C C C C C C C H H H H H H H H H H H H H
charge: -0.212928 -0.210350 -0.169283 -0.193955 -0.291515 -0.246661 0.109555 -0.495999 -0.383734 0.273446 -0.644531 -0.252230 0.280929 -0.654870 0.258740 0.272659 0.211660 0.219318 0.283662 0.226412 0.211412 0.212338 0.243509 0.236234 0.223075 0.236640 0.256468
chargesum: 0.00000
title: Mulliken charges with hydrogens summed into heavy atoms:
elementType: O O O O N N N C C C C C C C
charge: -0.212928 -0.210350 -0.169283 -0.193955 -0.007853 -0.246661 0.109555 0.035400 0.047244 0.273446 0.005631 0.227513 0.280929 0.061313
polarizability: 1.50873209e+02 5.53900898e+00 1.12922330e+02 3.51952712e+00 2.72146768e+00 9.01682479e+01
1716.lowfreq: -8.0867 -0.0011 -0.0007 -0.0006 3.2199 6.5568 15.1896 31.7312 38.5412
frequency: 13.4187 31.4727 38.3101 56.0431 84.5826 93.8157 103.1384 128.5101 141.7874 172.0568 204.0600 241.1371 249.2672 254.9448 287.0681 299.4915 331.6238 405.1163 426.8168 466.4448 486.5161 544.9235 572.8282 585.8427 614.9876 739.2809 757.5162 776.5168 811.0773 816.6116 850.9134 890.0064 962.2715 980.3234 1003.1156 1019.1231 1075.5631 1096.2543 1118.4957 1136.1075 1160.0589 1189.3241 1200.8151 1251.5834 1273.0974 1301.2384 1333.2916 1345.0432 1350.6652 1385.9036 1395.7828 1399.0392 1422.7762 1457.3990 1460.5064 1464.6093 1468.9128 1476.2065 1483.7411 1484.4729 1622.6222 1661.0745 2962.0634 2976.6035 2982.7023 2998.9951 3038.3309 3038.3843 3070.3100 3072.6620 3088.7941 3094.5167 3104.3173 3131.3983 3483.4407
redmass: 5.1011 4.0766 4.4326 2.8864 3.1718 3.7981 2.6879 6.1650 5.3646 7.7112 1.3885 1.7382 2.2227 3.7547 3.1455 3.3185 2.0350 4.0516 10.0614 2.1505 4.2614 7.8593 5.5305 1.6483 7.3660 7.0475 2.9304 1.2103 4.1519 1.4917 2.1138 4.5832 2.0925 9.8928 2.7221 2.4871 1.9138 2.2440 5.4202 1.8462 1.7115 3.1913 6.4603 1.3252 1.1250 1.1964 1.3011 1.2414 1.2655 1.2151 1.3391 6.4791 1.1004 1.0602 1.0818 1.0519 1.0702 1.1319 1.0543 1.1159 9.7250 10.7497 1.0692 1.0370 1.0610 1.0364 1.0636 1.0983 1.0967 1.0930 1.1011 1.0974 1.1025 1.1068 1.0743
irintensity: 1.8325 1.4886 0.1352 0.4049 0.2232 0.4379 2.9121 1.9415 1.4708 3.9147 4.9125 13.2468 1.8221 4.9291 19.1694 12.9718 21.3014 3.6917 15.6306 4.4725 3.8549 9.2130 5.8559 175.1126 45.1279 61.7871 30.8115 31.6621 61.6236 32.4330 5.8293 127.8806 21.3356 94.7198 47.8291 7.4674 23.0514 65.1930 465.3855 5.2372 56.9872 58.5444 163.1348 3.0826 7.5308 5.5697 10.7338 7.9209 3.7768 25.9058 78.7463 131.1463 18.9911 7.9162 17.1905 10.0600 21.4901 1.6970 15.3104 17.8632 99.7314 225.1929 30.3593 24.9936 43.5775 12.8952 13.5580 17.7248 60.8656 23.2389 39.6002 24.8872 2.0802 22.7955 3.8857
temp: 298.150 k
press: 1.00000 atm
elementType: 8 8 8 8 7 7 7 6 6 6 6 6 6 6 1 1 1 1 1 1 1 1 1 1 1 1 1
symmnumber: 1
zpe: 547280.0 jmol-1
zpe.correction: 0.208448 hartree
zpe.thermalcorrener: 0.224945 hartree
zpe.thermalcorrenthalpy: 0.225890 hartree
zpe.thermalcorrgfe: 0.161637 hartree
zpe.sumelectzpe: -738.498552 hartree
zpe.sumelectthermal: -738.482054 hartree
zpe.sumelectthermalent: -738.481110 hartree
zpe.sumelectthermalfe: -738.545362 hartree
dipole: 1.1172 -1.0433 -1.3048
dipole: 2.0097
quadrupole: -65.9100 -89.2147 -86.3534
quadrupole: -5.3822 -7.2741 1.4700
quadrupole: 14.5827 -8.7220 -5.8607 -5.3822 -7.2741 1.4700
hfenergy: -738.7069995 hartree
pointgroup: C01 [X(C7H13N3O4)]
dipole: 0.3214757 0.6826363 0.2362899 debye
polarizability: 151.8477448|1.2042727|108.4989268|1.4704661|-8.4939617|93.6171151 unknown
InChI: InChI=1S/C7H13N3O4/c1-3-8-5-6(11)10(9-13)7(12)14-4-2/h8H,3-5H2,1-2H3
charge 0 multiplicity 1
27 atoms
O  1.772888 1.546435 0.493576
O  -1.456547 1.688652 -0.176643
O  1.426536 0.502653 -1.577454
O  1.453307 -1.68509 0.889513
N  -3.690716 0.289675 0.983576
N  0.057782 0.006259 0.326105
N  0.261977 -1.266865 0.953204
C  -2.332389 -0.194889 1.179148
C  -4.482091 -0.309596 -0.116245
C  -1.261578 0.579882 0.37414
C  -3.96349 -0.078145 -1.559552
C  2.945064 2.323417 -0.053293
C  1.148726 0.704356 -0.384996
C  4.210384 1.465344 -0.034515
H  -2.27587 -1.270944 0.941955
H  -2.032786 -0.109033 2.24509
H  -4.557033 -1.397813 0.077882
H  -5.508901 0.092351 -0.027363
H  -3.755962 1.313808 1.016223
H  -3.870339 0.999917 -1.780837
H  -2.971538 -0.540647 -1.718455
H  -4.660933 -0.527955 -2.291402
H  2.684206 2.656039 -1.073054
H  3.005774 3.185369 0.628089
H  5.070629 2.079443 -0.358817
H  4.418052 1.088459 0.981039
H  4.119947 0.609122 -0.722812
