program: Gaussian 09
title: 000276077
version: EM64L-G09RevD.01
frameworkgroup: C1[X(C13H20F6O6P2)]
method: RPBEPBE
basis: SDD
operation: Freq
keyword: #p
keyword: freq=noraman
keyword: PBEPBE/SDD
title: #p freq=noraman PBEPBE/SDD
converged: YES YES NO NO
title: Mulliken charges:
elementType: P P F F F F F F O O O O O O C C C C C C C C C C C C C H H H H H H H H H H H H H H H H H H H H
charge: 1.332092 1.410432 -0.132185 -0.145960 -0.151784 -0.136906 -0.136169 -0.130968 -0.490245 -0.513687 -0.460110 -0.523062 -0.576859 -0.608186 -0.255238 -0.313514 0.248893 0.246730 0.213243 -0.272389 -0.234524 -0.221674 -0.237053 -0.654370 -0.639283 -0.659238 -0.646272 0.299765 0.224209 0.237269 0.227572 0.219114 0.235347 0.225981 0.233784 0.221255 0.257248 0.214653 0.213527 0.242089 0.237263 0.208619 0.253587 0.230881 0.214511 0.252313 0.239300
chargesum: 0.00000
title: Mulliken charges with hydrogens summed into heavy atoms:
elementType: P P F F F F F F O O O O O O C C C C C C C C C C C C C
charge: 1.332092 1.410432 -0.132185 -0.145960 -0.151784 -0.136906 -0.136169 -0.130968 -0.490245 -0.513687 -0.460110 -0.523062 -0.576859 -0.608186 -0.255238 -0.313514 0.248893 0.246730 0.213243 0.251585 0.230317 0.232787 0.222712 0.038786 0.053596 0.033849 0.059852
polarizability: 2.54621568e+02 3.22418611e+00 2.03372598e+02 2.63732762e+00 7.84648237e+00 1.99581276e+02
1716.lowfreq: -26.2414 -15.8271 -10.0633 -7.9975 -5.7468 -0.0003 0.0003 0.0008 5.8122
frequency: -25.9491 -14.7031 -8.6892 15.7254 26.4052 30.1651 33.7212 44.0021 45.0183 50.2117 64.8087 73.9352 79.8294 91.3726 102.7917 105.8959 133.2379 140.1074 151.2815 164.7143 174.9740 190.7162 193.5433 203.4473 208.7982 212.8180 224.8789 234.6864 240.3122 246.3670 248.8090 250.7132 254.9905 280.6331 297.9552 299.9021 312.9151 332.1767 347.5296 359.2732 386.4520 398.7529 405.0037 433.4018 449.0033 460.1294 473.2401 489.4026 531.6393 563.7777 578.2838 599.7886 620.0464 655.9198 670.2537 691.5832 732.1690 763.5577 787.9411 800.6346 804.2399 805.4590 810.1018 843.0936 868.1126 875.8647 878.8344 930.6954 996.3335 997.2055 1004.1657 1007.6134 1012.2424 1015.1372 1031.3282 1036.6956 1040.3622 1061.5460 1091.0920 1093.3354 1093.9209 1106.6886 1126.7479 1145.3620 1146.6719 1147.4966 1151.8929 1168.2078 1199.4634 1205.3959 1257.5812 1265.4630 1269.3100 1272.7011 1348.0918 1351.1612 1356.4834 1368.7364 1385.9816 1389.9214 1393.5805 1393.9445 1455.9266 1457.0201 1459.6881 1459.9144 1468.2639 1470.8676 1472.8350 1478.2174 1483.6914 1485.2305 1486.5337 1487.0609 1574.4294 2985.1011 2987.1537 2991.1559 2992.6683 2997.7848 3007.0028 3010.3005 3014.8817 3054.4830 3079.1911 3083.7673 3084.3897 3084.4662 3089.7919 3091.6727 3094.9985 3111.0354 3115.8512 3116.2431 3116.3165
redmass: 2.7309 3.3641 3.1863 4.4950 3.4984 2.9645 9.1559 5.4402 2.3457 3.0924 3.5693 3.2986 3.4242 4.0064 6.6863 5.8222 6.6898 7.4721 4.0830 6.2454 2.3955 3.2839 3.5897 6.1912 3.6318 7.5582 3.6086 1.8440 2.2795 1.8869 1.8555 4.6040 1.9720 5.7744 16.7122 15.7319 17.5388 7.5522 5.1035 5.5604 5.3707 4.6021 6.2552 4.0750 7.4653 6.9358 9.4994 13.8673 12.8372 14.2638 15.6451 7.6620 7.7974 9.3185 7.2659 7.7019 11.7590 12.8048 12.3299 1.1196 1.1204 1.1189 1.0938 4.4617 3.6613 3.8225 4.2688 12.9300 10.7281 2.5842 5.3914 3.5714 2.8705 3.1331 13.7930 12.0194 12.9056 13.0666 2.2458 2.1951 2.1836 2.2523 1.4065 1.5441 1.5522 1.5512 10.9114 12.1236 11.6540 12.2745 1.1523 1.1204 1.1148 1.1137 1.2193 1.2178 1.2485 1.1868 1.2351 1.2273 1.2272 1.2379 1.0389 1.0412 1.0406 1.0413 1.0747 1.0631 1.0707 1.0599 1.0667 1.0637 1.0555 1.0686 11.9859 1.0359 1.0549 1.0365 1.0369 1.0376 1.0631 1.0625 1.0612 1.1079 1.0974 1.1019 1.1022 1.1038 1.0979 1.0975 1.0982 1.1056 1.1031 1.1024 1.1039
irintensity: 0.5433 1.6028 0.4486 0.4548 0.5030 0.6557 0.4353 0.5571 4.8991 0.8832 0.8406 1.5428 1.5550 0.7587 1.5813 0.6202 0.7982 1.9201 25.6453 8.2201 8.2664 1.8531 0.9169 2.8630 2.6153 1.7329 1.0434 8.8522 4.9335 0.4486 6.0865 3.7293 5.6065 26.4622 6.7479 0.2688 0.6784 9.4752 1.9774 1.9967 2.6164 11.1477 57.5237 9.3222 53.8325 44.5741 33.5261 9.2477 1.7724 2.9577 2.5442 95.2305 23.7194 9.1646 59.7695 36.2488 76.5482 6.4638 4.5444 5.1038 6.8018 4.1585 2.3701 107.4743 213.6667 38.1183 200.7687 154.6065 10.6678 93.9154 35.2922 309.1121 203.1580 109.7703 96.6827 2.0370 193.9521 141.7003 12.1437 7.7644 13.8140 17.3229 4.4047 7.2304 9.1976 3.9966 177.7340 253.8073 10.9434 2.0906 0.4767 1.1504 1.1084 2.5818 15.9118 10.4372 4.9563 2.8600 25.5218 31.4939 35.7558 27.1100 11.2758 12.2325 15.1983 9.9630 2.2202 1.1006 6.6950 6.2564 4.4096 10.7703 12.2979 16.2634 14.2270 22.0893 23.1302 16.7132 17.0118 19.3677 29.1173 33.5902 24.1715 19.2933 31.0888 3.5399 6.6369 7.2247 27.6633 26.6305 21.8306 16.3589 28.1850 30.6082 19.0349
temp: 298.150 k
press: 1.00000 atm
elementType: 15 15 9 9 9 9 9 9 8 8 8 8 8 8 6 6 6 6 6 6 6 6 6 6 6 6 6 1 1 1 1 1 1 1 1 1 1 1 1 1 1 1 1 1 1 1 1
symmnumber: 1
zpe: 867626.6 jmol-1
zpe.correction: 0.330462 hartree
zpe.thermalcorrener: 0.361290 hartree
zpe.thermalcorrenthalpy: 0.362234 hartree
zpe.thermalcorrgfe: 0.266136 hartree
zpe.sumelectzpe: -2238.016349 hartree
zpe.sumelectthermal: -2237.985521 hartree
zpe.sumelectthermalent: -2237.984576 hartree
zpe.sumelectthermalfe: -2238.080674 hartree
dipole: 0.2657 -2.8827 1.0612
dipole: 3.0832
quadrupole: -144.0839 -187.9387 -164.9429
quadrupole: 3.7564 1.2752 4.4830
quadrupole: 21.5713 -22.2835 0.7123 3.7564 1.2752 4.4830
hfenergy: -2238.3468102 hartree
pointgroup: C01 [X(C13H20F6O6P2)]
dipole: 0.0487214 -0.9191073 0.790153 debye
polarizability: 249.229157|15.0441772|197.996239|7.6179674|4.9765446|210.3500464 unknown
InChI: InChI=1S/C13H20F6O6P2/c1-5-22-26(20,23-6-2)9-10(27(21,24-7-3)25-8-4)12(16,17)13(18,19)11(9,14)15/h5-8H2,1-4H3
charge 0 multiplicity 1
47 atoms
P  -1.44124 -1.022103 -0.172696
P  1.914589 -0.380754 0.887884
F  -1.690486 1.364266 -2.47889
F  -0.527656 -0.331477 -3.470851
F  2.848033 0.3594 -2.400455
F  2.509626 2.224191 -1.129862
F  0.388896 2.939975 -2.412711
F  1.180367 1.57207 -4.046205
O  -2.275565 0.099357 0.835031
O  -2.495539 -1.239064 -1.503927
O  2.19919 -2.069481 0.759417
O  3.458531 0.343408 0.667155
O  -0.862377 -2.327819 0.532431
O  1.114399 -0.00464 2.209396
C  -0.174925 0.011841 -1.094352
C  1.11531 0.236795 -0.705278
C  -0.475321 0.653143 -2.441414
C  1.855448 1.113171 -1.703805
C  0.747744 1.608075 -2.713133
C  -2.087734 0.058257 2.334507
C  -3.601154 -2.245538 -1.429717
C  2.714838 -2.670518 -0.512957
C  4.280297 0.73258 1.859173
C  -2.930464 -1.046173 2.972439
C  -4.890387 -1.611643 -0.904697
C  2.770745 -4.172055 -0.256848
C  3.890773 2.122478 2.364734
H  -1.011534 -0.051962 2.558457
H  -2.427533 1.065278 2.628179
H  -3.704441 -2.577483 -2.47545
H  -3.270059 -3.101231 -0.810269
H  2.015595 -2.428695 -1.336679
H  3.708238 -2.239068 -0.737253
H  4.173553 -0.036018 2.647886
H  5.308859 0.706624 1.464005
H  -2.856108 -0.966622 4.073621
H  -2.560353 -2.04288 2.677301
H  -3.994806 -0.949814 2.693694
H  -5.714613 -2.347048 -0.967349
H  -5.161762 -0.730661 -1.509998
H  -4.784239 -1.29172 0.145549
H  3.126232 -4.693191 -1.165056
H  1.767716 -4.549218 0.002057
H  3.459828 -4.402222 0.572944
H  4.587556 2.433255 3.166049
H  2.867384 2.118563 2.77652
H  3.94775 2.86117 1.547521
