program: Gaussian 09
title: 000270444
version: EM64L-G09RevD.01
frameworkgroup: C1[X(C13H17NO4)]
method: RPBEPBE
basis: SDD
operation: Freq
keyword: #p
keyword: freq=noraman
keyword: PBEPBE/SDD
title: #p freq=noraman PBEPBE/SDD
converged: YES YES NO NO
title: Mulliken charges:
elementType: O O O O N C C C C C C C C C C C C C H H H H H H H H H H H H H H H H H
charge: -0.320962 -0.255120 -0.201960 -0.203249 0.027328 0.398107 -0.074159 -0.752405 -0.763662 -0.726682 -0.741925 0.215742 0.218286 -0.322719 -0.315350 -0.351813 -0.345722 0.387183 0.260460 0.264761 0.223111 0.225174 0.217953 0.242149 0.228691 0.218112 0.231537 0.210419 0.221224 0.211344 0.232115 0.282164 0.281096 0.290295 0.288477
chargesum: 0.00000
title: Mulliken charges with hydrogens summed into heavy atoms:
elementType: O O O O N C C C C C C C C C C C C C
charge: -0.320962 -0.255120 -0.201960 -0.203249 0.027328 0.398107 0.186301 -0.039359 -0.074869 -0.066614 -0.077242 0.215742 0.218286 -0.040555 -0.034253 -0.061518 -0.057245 0.387183
polarizability: 2.50453130e+02 -2.99624428e+00 1.59165084e+02 -7.99229955e+00 -3.44490648e+00 1.03215701e+02
1716.lowfreq: -20.8491 -10.6879 -0.0007 -0.0005 -0.0004 4.0691 26.2700 31.2209 40.0734
frequency: 24.7241 31.1230 39.7719 65.2280 75.9239 89.9258 110.8453 170.1871 175.3886 199.0186 217.5261 227.8032 233.9585 241.9614 267.6654 281.6159 286.6824 330.2097 339.8546 374.3089 377.6510 410.3639 428.9648 457.5623 488.2620 498.5596 520.8839 539.6657 623.0633 652.1423 671.8532 686.1736 691.4571 765.0304 766.7308 775.8481 821.8697 864.4362 887.5536 888.8960 918.8102 927.3723 935.7392 960.1028 996.0763 1004.1605 1004.9882 1012.2704 1067.3378 1079.2596 1089.9829 1106.2335 1108.5665 1139.9778 1164.7036 1174.8519 1206.8725 1215.4014 1247.9229 1265.4367 1290.9830 1329.9100 1350.9618 1366.3691 1376.4881 1379.2018 1391.3208 1400.8857 1404.2754 1413.3969 1452.5255 1464.9790 1467.5652 1471.8693 1475.3942 1476.9286 1486.1093 1492.2257 1492.6347 1584.6083 1607.5650 1610.9148 2980.3525 2982.8132 2996.5695 3001.3974 3012.9941 3069.1917 3076.7817 3081.1993 3087.3092 3089.2322 3097.7022 3106.4924 3116.1342 3164.5640 3175.6974 3187.6878 3193.4385
redmass: 4.0694 4.5294 3.0550 6.3407 5.1759 7.3347 4.7788 2.6464 1.1553 5.3371 1.2232 1.2567 1.3120 3.7618 2.0524 3.2611 4.3422 3.1356 2.7286 4.3423 2.9280 2.8934 2.7698 3.8658 8.1754 3.4475 5.7312 2.8170 7.1165 6.1878 4.8022 3.9745 4.8616 4.8588 4.1686 9.1287 7.2187 1.2449 2.3698 1.6826 1.2930 1.4552 1.6019 1.4161 1.3071 1.4017 2.9482 1.3636 4.6117 1.5220 3.3108 1.6708 1.6567 2.2102 1.9782 1.2518 2.7165 6.8217 4.5182 3.4847 1.2601 1.3481 1.4265 7.7836 1.2195 1.2092 1.2262 1.2082 7.8092 4.6930 1.0542 1.0505 1.0519 2.3395 1.0646 1.0512 1.0487 1.0590 1.0512 9.3640 6.4486 9.2138 1.0357 1.0367 1.0361 1.0362 1.0837 1.0994 1.0982 1.0998 1.0991 1.0983 1.0991 1.0996 1.1000 1.0900 1.0890 1.0957 1.0972
irintensity: 0.0012 0.0248 0.0503 0.0311 0.0668 5.4494 0.8067 4.0013 0.6372 3.1845 0.9656 1.2110 0.0875 1.3611 0.5543 0.9781 2.9279 5.7136 1.4237 0.4482 5.0237 0.0064 1.7810 0.7221 5.6368 0.8371 3.6675 2.9027 0.3593 0.1651 9.7508 56.7915 2.5602 10.6494 27.2671 27.9603 15.3574 0.6138 18.5469 48.2872 3.6355 0.5062 4.4023 0.2701 0.4112 3.7058 38.9726 0.0164 383.7512 15.4220 9.5330 55.4276 13.0530 91.7395 15.6665 5.7590 30.1214 445.0678 154.2680 38.7751 1.2414 1.0454 5.6088 86.8011 8.8667 39.0129 32.9672 26.5991 11.6976 59.2481 16.2131 4.4788 4.2730 1.7603 5.2039 12.9824 9.7132 7.5182 18.2416 77.5096 5.0569 71.7049 26.6704 30.0180 13.2650 19.6662 0.3613 2.9520 66.0577 25.3394 46.3947 9.3624 43.3495 23.9240 11.6188 1.4456 1.0703 0.2879 0.4897
temp: 298.150 k
press: 1.00000 atm
elementType: 8 8 8 8 7 6 6 6 6 6 6 6 6 6 6 6 6 6 1 1 1 1 1 1 1 1 1 1 1 1 1 1 1 1 1
symmnumber: 1
zpe: 732314.5 jmol-1
zpe.correction: 0.278924 hartree
zpe.thermalcorrener: 0.297606 hartree
zpe.thermalcorrenthalpy: 0.298550 hartree
zpe.thermalcorrgfe: 0.230950 hartree
zpe.sumelectzpe: -859.805342 hartree
zpe.sumelectthermal: -859.786660 hartree
zpe.sumelectthermalent: -859.785716 hartree
zpe.sumelectthermalfe: -859.853316 hartree
dipole: 5.8909 1.0385 -0.4255
dipole: 5.9968
quadrupole: -130.0605 -107.6522 -105.6290
quadrupole: 7.8874 0.7896 -1.4080
quadrupole: -15.6133 6.7951 8.8182 7.8874 0.7896 -1.4080
hfenergy: -860.0842663 hartree
pointgroup: C01 [X(C13H17N1O4)]
dipole: 2.3221543 -0.2761538 0.3127128 debye
polarizability: 250.3310222|7.1812419|147.3780223|5.9217764|-23.1333686|115.1248702 unknown
InChI: InChI=1S/C13H17NO4/c1-9(2)13(3,4)18-12(15)10-5-7-11(8-6-10)14(16)17/h5-9H,1-4H3
charge 0 multiplicity 1
35 atoms
O  1.659035 -0.222649 0.536752
O  1.332769 1.840649 -0.541189
O  -5.563924 0.438486 -0.513681
O  -5.158504 -1.524996 0.573793
N  -4.768619 -0.422595 0.026759
C  3.193094 -0.116894 0.632086
C  3.776982 -0.075935 -0.819787
C  3.536148 1.140284 1.457791
C  3.534672 -1.399329 1.408441
C  3.319253 -1.270711 -1.690698
C  5.324384 0.015236 -0.810549
C  0.893045 0.773957 -0.03974
C  -0.570328 0.427402 0.001117
C  -1.483502 1.346285 -0.578382
C  -1.045671 -0.772771 0.590822
C  -2.863549 1.075232 -0.57442
C  -2.424224 -1.056871 0.603152
C  -3.311285 -0.126288 0.018367
H  3.390053 0.853619 -1.278243
H  3.358109 2.063572 0.884573
H  4.596345 1.107942 1.764182
H  2.923414 1.167868 2.376374
H  4.625799 -1.481488 1.550554
H  3.180362 -2.296753 0.875402
H  3.05879 -1.377319 2.403925
H  3.621098 -1.104604 -2.740743
H  2.222902 -1.399934 -1.670055
H  3.783187 -2.218575 -1.359771
H  5.693407 0.089365 -1.849637
H  5.785108 -0.883963 -0.360879
H  5.689613 0.903798 -0.266381
H  -1.087913 2.263542 -1.025158
H  -0.328344 -1.468356 1.032757
H  -3.590496 1.762717 -1.013923
H  -2.822207 -1.971622 1.04949
