program: Gaussian 09
title: 000270430
version: EM64L-G09RevD.01
frameworkgroup: C1[X(C17H13N5O3)]
method: RPBEPBE
basis: SDD
operation: Freq
keyword: #p
keyword: freq=noraman
keyword: PBEPBE/SDD
title: #p freq=noraman PBEPBE/SDD
converged: YES YES NO NO
title: Mulliken charges:
elementType: O O O N N N N N C C C C C C C C C C C C C C C C C H H H H H H H H H H H H H
charge: -0.261832 -0.225866 -0.221319 -0.324531 -0.470086 0.019988 -0.252318 0.018116 0.474008 0.092010 0.298548 0.231862 -0.416449 -0.304571 0.390326 -0.231693 -0.256022 -0.347781 -0.368367 -0.176868 -0.178768 -0.360420 -0.307819 -0.164484 -0.187911 0.421915 0.237210 0.312454 0.265278 0.261824 0.283330 0.283344 0.245851 0.245450 0.249615 0.247993 0.237500 0.240486
chargesum: 0.00000
title: Mulliken charges with hydrogens summed into heavy atoms:
elementType: O O O N N N N N C C C C C C C C C C C C C C C C C
charge: -0.261832 -0.225866 -0.221319 -0.324531 -0.048171 0.019988 -0.252318 0.018116 0.474008 0.092010 0.298548 0.231862 -0.179239 0.007883 0.390326 0.033584 0.005801 -0.064451 -0.085024 0.068983 0.066682 -0.110806 -0.059826 0.073016 0.052575
polarizability: 4.00808382e+02 3.88915690e+00 2.75957740e+02 -5.29287155e+00 8.84006068e+00 1.14090156e+02
1716.lowfreq: -5.1946 0.0004 0.0007 0.0009 2.7944 8.3979 21.0657 28.1385 39.3846
frequency: 20.9885 27.9035 39.3509 51.8243 56.5843 73.4050 79.1710 87.8856 101.4010 160.2778 171.0192 192.2050 211.5953 232.9646 274.9018 316.9312 319.5809 352.8377 404.7464 410.1900 411.3224 414.9171 417.1569 432.6048 505.1958 507.3122 512.6299 540.4934 607.7891 617.0983 623.9742 634.8436 664.3987 668.5693 688.3603 705.0533 732.6062 740.7764 744.7016 761.2986 774.3766 782.1053 813.4320 833.7201 835.6870 871.4949 876.7712 895.4335 941.2215 952.1022 955.7979 962.7297 980.8335 985.6266 992.0839 997.7063 1000.1897 1002.1529 1007.5555 1042.9313 1050.3504 1088.9572 1091.2445 1096.4309 1101.4460 1116.7480 1164.6995 1167.5282 1176.8404 1185.7514 1224.5213 1228.1054 1280.7905 1291.9853 1298.1573 1311.4524 1315.0514 1332.8744 1341.0191 1350.4811 1394.5513 1413.9269 1421.3533 1438.3294 1447.9324 1458.5068 1491.2028 1559.9836 1568.5353 1574.9654 1577.7102 1595.5986 1601.7835 1624.6323 1666.8879 2720.7382 3138.2061 3140.0952 3144.1536 3152.5233 3153.2653 3172.7576 3176.4817 3184.5151 3185.0844 3187.6917 3201.8004 3205.4905
redmass: 5.0164 7.0824 5.6926 6.4524 5.2183 6.6678 6.1679 5.8557 6.6615 8.0834 7.9007 7.7960 5.3308 6.1057 5.8347 6.4180 6.5740 7.3557 5.5951 4.2139 4.1910 6.3348 3.0353 5.7947 3.8534 3.2924 5.2851 3.5920 7.8660 7.1295 7.1429 6.9909 7.2974 4.7776 6.5523 9.5972 2.3518 4.4103 2.0015 3.6922 1.9902 3.3344 4.3878 1.3529 5.3434 1.3401 1.5430 1.3042 6.1273 1.4118 1.7543 3.9511 1.3370 5.9982 1.3844 3.5291 1.4692 4.1186 1.3221 2.2143 2.2615 1.1457 1.5486 2.9787 1.7587 1.2989 1.0767 1.9061 1.3544 1.5171 3.7135 4.0303 1.8921 1.8565 1.5651 2.5659 2.0314 5.9071 10.6055 7.9547 6.9478 1.9664 2.2607 4.6731 2.2099 2.2575 2.7528 5.9545 6.1018 5.1661 5.8531 5.2297 6.3899 5.6831 1.7997 1.0957 1.0886 1.0905 1.0892 1.0907 1.0914 1.0972 1.0905 1.0986 1.0949 1.0994 1.0955 1.0955
irintensity: 0.5111 0.2386 0.9223 1.2820 0.6935 3.3219 2.1296 2.9083 1.0563 10.9830 0.3252 0.4506 1.0489 1.5754 12.0857 0.6130 3.2154 0.1857 3.7493 3.8625 7.9253 25.0512 0.1838 3.8101 5.0812 17.3160 3.1137 7.4017 6.8066 2.3906 0.3875 14.2295 14.0653 25.0116 16.2827 2.2713 14.9971 6.3451 24.3367 42.7009 61.9879 24.1032 4.0767 8.6981 10.2868 0.2969 65.2162 5.3098 4.9669 1.7789 4.0241 8.1986 3.3458 5.4903 0.0071 7.9384 5.0185 42.3488 0.0980 7.0010 15.8522 69.9993 2.2905 29.6922 37.7159 34.0688 4.9013 625.3429 145.1201 215.6333 377.2213 224.9542 74.1589 35.2014 37.1198 43.3905 122.5301 25.2623 13.8723 87.1783 91.5992 36.4374 163.1659 18.7718 131.8148 129.8279 23.4604 9.2588 67.9894 396.9458 81.6132 659.3001 459.2712 34.9713 603.1228 1317.5772 9.3139 12.9404 7.7234 9.2910 10.7354 30.1743 1.4024 15.8935 2.8190 2.4610 2.8742 2.8577
temp: 298.150 k
press: 1.00000 atm
elementType: 8 8 8 7 7 7 7 7 6 6 6 6 6 6 6 6 6 6 6 6 6 6 6 6 6 1 1 1 1 1 1 1 1 1 1 1 1 1
symmnumber: 1
zpe: 728728.9 jmol-1
zpe.correction: 0.277558 hartree
zpe.thermalcorrener: 0.297722 hartree
zpe.thermalcorrenthalpy: 0.298666 hartree
zpe.thermalcorrgfe: 0.225785 hartree
zpe.sumelectzpe: -1153.247954 hartree
zpe.sumelectthermal: -1153.227790 hartree
zpe.sumelectthermalent: -1153.226846 hartree
zpe.sumelectthermalfe: -1153.299727 hartree
dipole: -11.8344 3.1026 -1.8357
dipole: 12.3713
quadrupole: -173.9287 -121.2077 -144.9141
quadrupole: 9.5065 3.9912 2.3459
quadrupole: -27.2452 25.4758 1.7694 9.5065 3.9912 2.3459
hfenergy: -1153.5255119 hartree
pointgroup: C01 [X(C17H13N5O3)]
dipole: -4.6257591 -1.2032914 0.9189248 debye
polarizability: 400.9209505|-2.973977|276.4062291|-2.6944424|0.2160904|113.5290995 unknown
InChI: InChI=1S/C17H13N5O3/c23-17(20-13-7-9-14(10-8-13)22(24)25)21(15-5-1-3-11-18-15)16-6-2-4-12-19-16/h1-12,20H
charge 0 multiplicity 1
38 atoms
O  -0.277182 1.901157 0.066495
O  6.970374 -0.636919 -0.203398
O  6.719952 1.632513 -0.235584
N  -1.758197 0.076638 0.178121
N  0.59662 -0.292448 0.051966
N  -3.634769 0.961712 -1.010664
N  -1.098557 -2.224337 0.169428
N  6.237214 0.431717 -0.194652
C  1.977669 -0.038652 -0.011407
C  -2.830934 1.055587 0.080374
C  -2.105421 -1.299534 0.260221
C  -0.419026 0.646245 0.093845
C  2.835837 -1.180647 -0.025439
C  2.55215 1.266777 -0.062769
C  4.775926 0.269822 -0.13313
C  -2.975141 2.048299 1.074913
C  -3.45493 -1.714167 0.465131
C  4.227217 -1.033682 -0.08569
C  3.947313 1.414911 -0.122979
C  -4.009106 2.996897 0.923356
C  -3.735113 -3.08637 0.565263
C  -4.63835 1.877116 -1.138098
C  -1.384969 -3.552897 0.268736
C  -4.859477 2.913403 -0.203284
C  -2.689049 -4.037989 0.462746
H  0.228401 -1.297993 0.062106
H  2.395696 -2.183305 0.012191
H  1.895527 2.137821 -0.057852
H  -2.286513 2.08172 1.921916
H  -4.258896 -0.981623 0.534868
H  4.896794 -1.897321 -0.096257
H  4.407785 2.40562 -0.163596
H  -4.144848 3.786175 1.66946
H  -4.767659 -3.414381 0.722827
H  -5.269366 1.770539 -2.027259
H  -0.529814 -4.23164 0.187097
H  -5.670434 3.631229 -0.35921
H  -2.878521 -5.111888 0.533604
