program: Gaussian 09
title: 000270424
version: EM64L-G09RevD.01
frameworkgroup: C1[X(C12H16N2O4S)]
method: RPBEPBE
basis: SDD
operation: Freq
keyword: #p
keyword: freq=noraman
keyword: PBEPBE/SDD
title: #p freq=noraman PBEPBE/SDD
converged: NO YES NO NO
title: Mulliken charges:
elementType: S O O O O N N C C C C C C C C C C C C H H H H H H H H H H H H H H H H
charge: 0.170255 -0.227862 -0.229041 -0.204733 -0.204434 -0.178258 -0.178178 -0.543647 -0.542038 -0.537570 -0.537390 0.287229 0.287914 0.187306 0.187062 -0.333364 -0.333403 -0.661330 -0.661321 0.383005 0.381888 0.277705 0.274551 0.277902 0.274606 0.245471 0.244004 0.245789 0.243863 0.237981 0.239064 0.224904 0.236987 0.240122 0.224960
chargesum: 0.00000
title: Mulliken charges with hydrogens summed into heavy atoms:
elementType: S O O O O N N C C C C C C C C C C C C
charge: 0.170255 -0.227862 -0.229041 -0.204733 -0.204434 -0.178258 -0.178178 -0.160643 -0.160150 0.014686 0.015118 0.287229 0.287914 0.187306 0.187062 0.156111 0.156248 0.040619 0.040747
polarizability: 2.33512363e+02 1.62077738e+01 1.54866253e+02 8.64524654e-02 -7.89628019e-02 1.29023946e+02
1716.lowfreq: -16.2251 -3.7857 0.0010 0.0012 0.0016 0.9951 2.4957 18.5934 22.1343
frequency: -12.2653 18.0695 21.8024 33.5676 46.2783 65.2581 71.2547 97.4174 116.9864 150.5843 152.3943 191.9816 199.2620 214.0775 216.2732 236.1450 288.9092 289.6830 311.7025 346.1887 354.9620 410.9921 411.9652 537.0192 537.7322 549.9605 557.7928 572.9391 582.0281 584.2863 611.5273 665.0613 666.9067 720.0528 724.6465 740.5118 744.4228 780.2084 781.6605 939.1586 939.7447 951.6750 957.2859 964.9334 969.2055 1035.8196 1050.7467 1067.3863 1070.1228 1098.7858 1099.1080 1121.3360 1126.1910 1152.3932 1158.2745 1206.9290 1218.4585 1220.9805 1224.7926 1258.4950 1266.9892 1284.7694 1288.1635 1331.2068 1333.8770 1339.7030 1340.2777 1366.6405 1368.1241 1389.1996 1390.6655 1440.7176 1441.0708 1451.7067 1452.5270 1472.6417 1472.8179 1481.9174 1482.1490 1619.0088 1620.7798 1690.3897 1690.9377 2995.0071 2995.2779 3026.4000 3026.5913 3027.2483 3027.5614 3049.6956 3053.7210 3084.0611 3084.3496 3087.0077 3087.3477 3094.8966 3094.9836 3110.3654 3110.6353
redmass: 2.9653 4.7633 3.7290 3.0088 6.8770 6.1077 5.1342 4.1868 4.1716 5.5343 5.1611 2.0317 1.3677 2.2420 3.7205 5.3317 1.8973 1.9105 4.2925 7.6797 7.7210 4.4425 3.9835 5.6651 4.7242 3.4565 3.5330 4.6225 5.2885 5.4939 4.5681 5.2786 5.2146 4.6782 4.4583 4.7967 4.6603 1.3563 1.3461 2.5640 2.5784 2.1289 2.3337 2.5646 2.4712 2.7749 2.7365 4.9706 4.3590 2.0992 2.0922 2.8419 2.8456 1.1566 1.1767 1.4421 2.1357 1.2489 1.5940 1.5064 1.5821 1.4353 1.3970 2.7171 2.3910 1.4045 1.4646 1.7290 1.7857 1.2364 1.2351 1.0806 1.0803 1.0970 1.0970 1.0416 1.0415 1.0525 1.0525 11.7837 11.3766 11.2485 11.1983 1.0351 1.0352 1.0591 1.0592 1.0621 1.0621 1.0875 1.0881 1.1036 1.1036 1.1007 1.1008 1.0992 1.0992 1.1041 1.1041
irintensity: 0.0694 0.0662 0.0410 0.2469 0.0810 4.1379 1.9962 4.3881 11.1494 2.5160 2.5406 1.1352 2.4291 5.8898 0.7703 2.3059 5.5952 2.1617 7.6870 2.8364 42.6142 11.3803 1.7729 2.3439 2.2775 1.7967 2.6623 2.7271 2.9525 2.4177 0.1485 59.2655 6.4974 50.9847 0.5920 5.1302 1.9742 50.0573 13.6293 32.7159 4.1693 12.6352 5.9945 15.2369 0.0769 8.0815 0.9869 16.1754 8.3903 3.8904 3.3940 193.6770 33.3016 9.6763 0.3638 67.1306 23.2439 18.6144 74.0351 32.9041 0.4279 12.1502 0.2219 279.3110 43.5731 85.0402 14.4261 120.6120 18.7547 11.6928 11.8416 13.3005 19.7109 26.5328 29.0793 22.1716 21.7831 8.6271 8.4516 814.4092 249.9032 126.7000 0.8529 19.7048 17.0224 16.5087 19.3738 3.2532 2.7319 42.3919 10.5098 1.4274 1.3852 1.4662 2.7393 44.3090 26.5216 16.0185 16.2210
temp: 298.150 k
press: 1.00000 atm
elementType: 16 8 8 8 8 7 7 6 6 6 6 6 6 6 6 6 6 6 6 1 1 1 1 1 1 1 1 1 1 1 1 1 1 1 1
symmnumber: 1
zpe: 714205.1 jmol-1
zpe.correction: 0.272026 hartree
zpe.thermalcorrener: 0.291017 hartree
zpe.thermalcorrenthalpy: 0.291961 hartree
zpe.thermalcorrgfe: 0.221613 hartree
zpe.sumelectzpe: -1273.964844 hartree
zpe.sumelectthermal: -1273.945854 hartree
zpe.sumelectthermalent: -1273.944909 hartree
zpe.sumelectthermalfe: -1274.015258 hartree
dipole: -0.0301 -0.0016 0.3505
dipole: 0.3518
quadrupole: -128.1286 -120.3763 -123.2801
quadrupole: -16.3158 -0.0815 0.0509
quadrupole: -4.2003 3.5520 0.6483 -16.3158 -0.0815 0.0509
hfenergy: -1274.2368702 hartree
pointgroup: C01 [X(C12H16N2O4S1)]
dipole: -0.0158934 -0.0193578 0.1361221 debye
polarizability: 229.3846709|23.132575|158.2464801|6.1384199|4.3978791|129.7714107 unknown
InChI: InChI=1S/C12H16N2O4S/c1-3-13-9(15)5-7(11(13)17)19-8-6-10(16)14(4-2)12(8)18/h7-8H,3-6H2,1-2H3
charge 0 multiplicity 1
35 atoms
S  0.036864 0.127355 -1.463164
O  1.759625 -1.190376 1.077043
O  -1.827223 0.827048 1.225204
O  4.479213 2.230839 -0.612343
O  -4.466184 -1.996398 -1.423056
N  3.366734 0.369021 0.325513
N  -3.397206 -0.454244 0.013353
C  1.087435 0.926081 -0.084241
C  -1.102101 -0.956678 -0.379741
C  1.981986 2.047746 -0.651965
C  -1.970075 -1.884629 -1.254874
C  2.052327 -0.104578 0.513554
C  -2.093092 -0.078171 0.392933
C  3.420954 1.617936 -0.343615
C  -3.421309 -1.498866 -0.945329
C  4.567876 -0.37702 0.751628
C  -4.614396 0.19894 0.535944
C  5.061532 -1.346684 -0.341198
C  -4.998285 1.44513 -0.287145
H  0.365744 1.265928 0.677049
H  -0.431081 -1.487159 0.315825
H  1.778369 3.02529 -0.18367
H  1.878222 2.186819 -1.742502
H  -1.812605 -2.950935 -1.021253
H  -1.792602 -1.764028 -2.338043
H  5.344803 0.370039 0.988844
H  4.298894 -0.929454 1.668444
H  -5.421651 -0.552934 0.505301
H  -4.41101 0.475074 1.585046
H  5.336269 -0.798713 -1.258736
H  4.284868 -2.091022 -0.586703
H  5.955549 -1.887079 0.017533
H  -5.208813 1.175431 -1.336239
H  -4.189204 2.194972 -0.26479
H  -5.907129 1.906321 0.138693
