program: Gaussian 09
title: 000270420
version: EM64L-G09RevD.01
frameworkgroup: C1[X(C12H9ClN2O)]
method: RPBEPBE
basis: SDD
operation: Freq
keyword: #p
keyword: freq=noraman
keyword: PBEPBE/SDD
title: #p freq=noraman PBEPBE/SDD
converged: NO NO NO NO
title: Mulliken charges:
elementType: Cl O N N C C C C C C C C C C C C H H H H H H H H H
charge: -0.019705 -0.257570 -0.457439 -0.086437 0.485281 0.021563 0.149821 -0.345937 -0.443795 -0.217838 -0.214477 -0.195441 -0.253039 -0.055279 -0.147773 -0.350075 0.351192 0.304964 0.227706 0.306105 0.227444 0.226545 0.229274 0.261101 0.253808
chargesum: 0.00000
title: Mulliken charges with hydrogens summed into heavy atoms:
elementType: Cl O N N C C C C C C C C C C C C
charge: -0.019705 -0.257570 -0.106246 -0.086437 0.485281 0.021563 0.149821 -0.040973 -0.216089 0.088268 0.012967 0.031104 -0.023764 -0.055279 0.113328 -0.096267
polarizability: 2.92349813e+02 -6.01302573e+00 1.58607820e+02 7.91509162e-04 -4.28859081e-03 5.83349872e+01
1716.lowfreq: -2.0662 -0.0017 0.0009 0.0016 5.1589 6.1536 33.8028 49.4576 70.5510
frequency: 33.7607 49.4435 70.5495 100.9969 153.4894 183.2546 195.6213 204.0768 272.2260 326.7905 339.6884 393.5595 407.9234 423.6351 480.6126 506.7372 533.9125 573.4403 614.3997 680.3980 686.4308 696.8803 722.9295 769.4420 770.9891 828.8458 833.3500 839.9963 860.5940 880.9516 923.2448 935.1318 960.6483 965.5452 976.1014 984.7771 1000.7127 1024.5920 1073.1601 1084.2649 1092.3730 1120.7598 1172.7649 1187.2953 1228.8262 1260.8175 1280.3374 1314.9409 1324.7723 1381.8225 1386.8408 1434.2640 1438.4924 1485.4739 1524.3931 1546.0096 1562.0286 1596.4633 1611.1271 1615.8753 3114.5535 3131.3892 3144.3427 3149.1902 3164.2730 3181.0848 3184.0270 3190.9721 3384.6492
redmass: 8.8965 4.2452 7.1327 6.4055 5.6535 10.2827 6.9689 6.5217 4.7025 5.5596 8.4813 12.2049 2.9180 3.1210 7.9774 3.8538 4.1934 6.8769 6.4896 7.4961 5.1355 1.8902 8.6122 1.7378 4.0424 1.2111 5.3616 1.3464 1.2059 7.5665 1.4466 1.4138 1.4020 7.0409 1.3529 6.2039 1.3097 2.1974 1.6811 1.9414 1.6630 2.7025 1.0517 1.1143 2.3548 2.3339 1.6178 5.9837 1.4411 3.6540 7.0089 2.1698 2.3488 2.3321 2.2780 6.9383 6.9765 5.1044 6.2801 6.8355 1.0883 1.0870 1.0936 1.0903 1.0998 1.0937 1.0970 1.0954 1.0766
irintensity: 0.8441 0.7457 0.5925 1.2915 1.6650 1.0545 1.3569 7.9666 1.2770 4.0431 7.9503 7.5436 0.1026 3.6818 5.4428 31.2562 0.2941 21.3662 0.8625 22.5254 0.0078 41.7629 63.6395 38.2047 15.6218 95.9641 8.5602 12.1220 34.1255 4.9779 21.3607 9.9864 0.0135 0.2905 0.0048 0.2322 3.1729 8.2896 3.7187 21.5404 13.7986 2.5418 0.5155 0.0173 41.9835 5.8565 1.8515 6.0087 21.8149 17.0241 20.2573 100.6704 15.5197 14.2622 551.3983 83.1715 126.9344 41.5501 117.8790 31.7304 9.8680 0.5303 29.4408 14.5856 31.0841 2.5874 6.2011 7.2877 100.9698
temp: 298.150 k
press: 1.00000 atm
elementType: 17 8 7 7 6 6 6 6 6 6 6 6 6 6 6 6 1 1 1 1 1 1 1 1 1
symmnumber: 1
zpe: 481935.1 jmol-1
zpe.correction: 0.183559 hartree
zpe.thermalcorrener: 0.196623 hartree
zpe.thermalcorrenthalpy: 0.197567 hartree
zpe.thermalcorrgfe: 0.142267 hartree
zpe.sumelectzpe: -1106.374128 hartree
zpe.sumelectthermal: -1106.361064 hartree
zpe.sumelectthermalent: -1106.360120 hartree
zpe.sumelectthermalfe: -1106.415420 hartree
dipole: 0.7739 3.6621 0.0001
dipole: 3.7430
quadrupole: -85.9676 -93.0809 -104.1820
quadrupole: 5.0503 0.0016 -0.0029
quadrupole: 8.4426 1.3292 -9.7718 5.0503 0.0016 -0.0029
hfenergy: -1106.5576869 hartree
pointgroup: C01 [X(C12H9Cl1N2O1)]
dipole: 0.3596086 -1.4280349 0.0020617 debye
dipolederiv: -0.7514915 -0.3124551 0.0002251 -0.4084964 -0.3047951 0.000221 0.0003391 0.0002419 -0.0506075 -0.6754283 0.1144565 -0.0002112 -0.5133406 -0.8699414 0.0006087 0.0006094 0.0006991 -0.3446171 -1.6487116 -0.2395975 0.0000666 -0.2728435 -0.4907008 0.0002102 0.0000643 0.0001922 -0.271263 -0.6901719 0.003533 -0.0001102 0.1511643 -0.3995484 0.0002826 -0.0002309 0.0002239 -0.196535 1.1028826 0.0459227 0.0001072 -0.1499213 0.0372866 0.0000512 0.0003918 0.0001086 0.1053948 0.5422156 -0.0277755 0.0001447 0.2570138 0.1274853 -0.0000598 -0.0002334 -0.0001284 0.0222177 1.3560619 0.0855076 0.0001363 0.7587973 1.0911464 -0.0010549 -0.0007919 -0.0011637 0.1848279 -0.2491497 0.0112996 -0.0000424 0.1028226 -0.0702796 -0.0001523 -0.0001942 -0.0001376 -0.165835 -0.2144523 -0.0265148 0.0000414 -0.0834742 0.0231086 -0.0004133 0.0001709 -0.0004122 -0.2049698 -0.8362247 -0.0924467 -0.0000668 -0.1357066 -0.0866474 0.0000412 -0.000037 0.0000526 -0.0261488 0.0329982 -0.0367618 0.0000909 -0.1517958 0.1484006 -0.0005348 0.0003076 -0.0004992 -0.1454811 0.0262573 0.0271534 -0.0000191 0.1728309 0.1183112 -0.0004059 -0.0002952 -0.0004444 -0.1422325 -0.0356207 -0.0268945 0.000062 -0.0311473 -0.1268458 -0.0000949 0.0000849 -0.0000925 -0.1816443 1.3592934 0.4931182 -0.0002893 0.548857 0.5786763 -0.0006425 -0.0003429 -0.0006534 -0.0404995 -0.335859 -0.2607459 0.000268 -0.1106453 -0.3684948 0.0003411 0.0000671 0.0003126 -0.0681247 0.2343492 0.1911305 -0.0001622 -0.1824741 0.3845818 -0.0005919 0.0002837 -0.000501 -0.0646071 0.4599426 -0.068267 0.0001116 -0.0933843 0.1812768 0.0001492 0.0001536 0.0001837 0.2833405 0.1497949 -0.0615681 0.0001068 -0.0412317 0.0598913 0.0002074 0.0000897 0.0001822 0.181609 0.0373326 0.1089169 -0.0002098 0.0880739 -0.0523102 0.0004027 -0.0001666 0.0004088 0.1677511 0.2118445 0.0159063 -0.0000119 -0.0059324 0.0653281 0.0001246 0.0000212 0.0001326 0.1670661 0.0233049 0.0700795 -0.0001453 0.1109346 -0.0788734 0.0004194 -0.0002187 0.0004095 0.1537115 -0.0031388 -0.0933319 0.00013 -0.1233334 -0.060708 0.0003515 0.000184 0.0003583 0.1577323 -0.1461138 0.0160379 -0.0000822 0.0165618 0.0897662 0.0001377 -0.0000818 0.0001326 0.1689073 -0.0016206 0.0625025 -0.0001198 0.0407443 0.0905646 0.00011 -0.0000835 0.0001123 0.1704896 0.0517056 0.0007943 -0.0000205 0.0559267 -0.0866788 0.0002916 -0.0000912 0.0002816 0.1395174 unknown
polarizability: 291.6906821|11.1299335|159.2667355|0.0341003|-0.1436718|58.3352023 unknown
InChI: InChI=1S/C12H9ClN2O/c13-9-6-7-14-11(8-9)12(16)15-10-4-2-1-3-5-10/h1-8,15H
charge 0 multiplicity 1
25 atoms
Cl 5.473627 1.268221 -0.002207
O  0.042703 1.917052 -0.004426
N  -0.803832 -0.299168 -0.001643
N  1.649499 -1.340446 0.000119
C  -2.209405 -0.119356 -0.002151
C  1.575969 0.027296 -0.001586
C  0.19532 0.655136 -0.002754
C  -2.822264 1.163317 -0.004444
C  -3.018718 -1.289288 -0.000282
C  2.710754 0.869587 -0.002394
C  -4.230954 1.254302 -0.004822
C  -4.42307 -1.180239 -0.000718
C  -5.039621 0.094283 -0.002989
C  3.974049 0.252157 -0.0013
C  4.084439 -1.154314 0.000502
C  2.886056 -1.906778 0.001131
H  -0.429919 -1.261513 -0.000097
H  -2.195698 2.057484 -0.00585
H  -2.544485 -2.279289 0.001535
H  2.568803 1.953437 -0.003795
H  -4.698106 2.245665 -0.006594
H  -5.035512 -2.088785 0.000734
H  -6.131607 0.179617 -0.003319
H  5.057345 -1.652309 0.001364
H  2.923528 -3.00077 0.002488
