program: Gaussian 09
title: 000275948
version: EM64L-G09RevD.01
frameworkgroup: C1[X(C15H14N2O3)]
method: RPBEPBE
basis: SDD
operation: Freq
keyword: #p
keyword: freq=noraman
keyword: PBEPBE/SDD
title: #p freq=noraman PBEPBE/SDD
converged: YES YES NO NO
title: Mulliken charges:
elementType: O O O N N C C C C C C C C C C C C C C C H H H H H H H H H H H H H H
charge: -0.300081 -0.278071 -0.277369 -0.456677 -0.637560 0.473269 0.492767 -0.478299 0.316595 -0.465463 -0.353321 -0.322984 -0.368307 -0.365523 -0.386809 0.284788 -0.227013 -0.225312 -0.231727 0.145071 0.246966 0.225465 0.225704 0.302242 0.210353 0.277615 0.268975 0.232810 0.332652 0.230356 0.228137 0.231018 0.314071 0.335663
chargesum: 0.00000
title: Mulliken charges with hydrogens summed into heavy atoms:
elementType: O O O N N C C C C C C C C C C C C C C C
charge: -0.300081 -0.278071 -0.277369 -0.124025 0.012175 0.473269 0.492767 -0.005867 0.316595 -0.239760 -0.051079 -0.112631 -0.090692 -0.096549 -0.153999 0.284788 0.003343 0.002825 -0.000709 0.145071
polarizability: 2.87281281e+02 -1.70640804e+01 1.58003215e+02 5.20975641e+00 -2.16735336e+01 1.38619320e+02
1716.lowfreq: -5.8095 -0.0007 -0.0006 -0.0002 2.8730 8.5962 17.1672 22.9471 32.3893
frequency: 17.0443 22.7722 32.2235 45.1114 55.3317 78.3542 96.8846 125.2217 163.1145 188.6231 220.7711 252.9740 296.9611 319.8477 335.0341 380.7897 403.5228 406.8532 425.2312 461.7522 478.2316 498.0916 510.3921 574.9107 580.1954 599.8304 617.5693 626.4807 646.8265 669.7249 693.8109 700.4285 706.0248 720.4094 760.3717 762.1080 816.1167 821.4655 829.6131 858.6905 880.9233 885.7571 935.0152 940.9950 964.7034 981.9667 987.4625 992.0299 1001.6504 1005.8663 1010.7769 1027.0548 1045.2416 1091.4994 1123.1410 1133.8434 1158.2042 1174.0125 1189.4109 1196.9965 1222.6978 1239.4755 1268.0676 1310.3278 1330.1519 1346.4570 1351.9264 1376.8704 1386.0064 1422.2895 1442.8237 1462.6302 1484.8254 1492.7208 1521.4220 1566.7618 1594.8376 1597.9712 1614.9513 1622.8601 1633.8831 1661.4247 3037.7081 3112.0820 3114.9266 3120.1042 3128.8604 3140.2663 3140.4080 3151.4274 3158.4158 3165.6777 3193.4445 3530.9917 3538.4123 3684.4834
redmass: 6.0183 4.6809 4.2599 4.3176 6.9787 7.5464 5.5603 5.8002 5.7585 5.8454 7.8384 6.3002 4.7209 5.8320 3.3147 3.2265 2.8121 2.7480 3.7591 1.6125 2.5979 3.6483 2.5435 4.7180 1.2625 4.0922 6.2493 6.8177 1.3789 5.8256 3.4061 3.1217 2.4044 3.6201 2.9640 2.9503 3.5501 1.5409 4.7760 1.2478 6.0630 1.4926 1.4817 1.4123 2.5242 1.5171 3.2493 5.0023 1.3313 2.5151 1.4821 2.2141 1.9364 1.5171 2.4651 1.4636 3.2932 1.0545 1.1231 1.1288 2.8513 1.1577 2.1206 1.3344 1.2583 1.3651 3.1744 5.6805 8.0582 4.1776 2.1781 1.1273 2.2960 2.0222 3.0529 3.5274 6.0796 2.6375 6.0810 4.9842 2.2093 7.9897 1.0588 1.1071 1.0871 1.0871 1.0872 1.0960 1.0920 1.0965 1.0906 1.1016 1.0949 1.0447 1.0761 1.1038
irintensity: 0.0742 7.7495 0.5964 3.5877 0.9091 5.7378 1.9577 0.3897 2.5476 2.8745 2.1287 26.6208 0.3346 3.3936 5.4693 17.7945 0.1476 2.9244 1.8965 51.9723 46.7400 20.9498 104.7359 8.3637 56.5482 35.4748 1.1128 2.8641 24.2428 6.1667 77.6009 23.1641 67.1215 14.4667 42.1794 54.4828 9.3950 40.9374 22.0761 0.2867 6.7345 48.8730 13.7822 1.5967 107.7540 23.3698 179.2392 104.2967 1.0609 9.3712 2.2228 2.7717 2.1382 9.8928 21.8189 18.7988 539.7110 0.3406 0.0771 41.5826 27.2434 13.3859 3.6680 30.8863 3.8117 26.4675 231.9879 362.4377 1.4503 66.4870 9.3235 24.9925 6.0098 197.6210 414.2454 233.1165 1.5741 8.5592 1.8130 149.3280 305.1077 168.5146 36.4418 5.1838 18.9394 6.4226 1.4564 19.5139 16.9009 27.4582 0.6985 22.2584 1.9751 43.9684 33.5544 28.2431
temp: 298.150 k
press: 1.00000 atm
elementType: 8 8 8 7 7 6 6 6 6 6 6 6 6 6 6 6 6 6 6 6 1 1 1 1 1 1 1 1 1 1 1 1 1 1
symmnumber: 1
zpe: 692008.9 jmol-1
zpe.correction: 0.263572 hartree
zpe.thermalcorrener: 0.281320 hartree
zpe.thermalcorrenthalpy: 0.282264 hartree
zpe.thermalcorrgfe: 0.214365 hartree
zpe.sumelectzpe: -913.792501 hartree
zpe.sumelectthermal: -913.774753 hartree
zpe.sumelectthermalent: -913.773809 hartree
zpe.sumelectthermalfe: -913.841708 hartree
dipole: 2.5074 -3.3260 4.8025
dipole: 6.3571
quadrupole: -108.7500 -110.4839 -112.8766
quadrupole: 10.9389 -19.4698 -0.8087
quadrupole: 1.9535 0.2196 -2.1731 10.9389 -19.4698 -0.8087
hfenergy: -914.0560728 hartree
pointgroup: C01 [X(C15H14N2O3)]
dipole: 0.9383526 -1.6354855 -1.6432118 debye
polarizability: 284.8040236|2.7250267|132.4106062|-25.1080137|17.0314082|166.689187 unknown
InChI: InChI=1S/C15H14N2O3/c16-14(18)12-6-8-13(9-7-12)17-15(19)20-10-11-4-2-1-3-5-11/h1-9,17H,10,16H2
charge 0 multiplicity 1
34 atoms
O  1.900145 0.701787 -1.566146
O  0.869892 1.580119 0.368919
O  -5.97441 0.374812 1.901639
N  -0.236344 0.122277 -1.142267
N  -6.366775 -1.463477 0.552811
C  4.073484 0.446773 -0.368749
C  -1.53528 0.008146 -0.587036
C  3.189341 1.373196 -1.174082
C  -4.181418 -0.319805 0.415782
C  -2.466154 -0.823988 -1.267039
C  -1.936973 0.687696 0.595418
C  -3.771256 -0.985076 -0.769263
C  -3.247656 0.519577 1.074877
C  3.937396 0.370455 1.042092
C  5.046962 -0.356724 -1.014635
C  0.832394 0.868459 -0.665416
C  4.757959 -0.501784 1.790671
C  5.869523 -1.228126 -0.266472
C  5.725499 -1.302324 1.138684
C  -5.558375 -0.430745 1.011194
H  2.931232 2.287327 -0.612367
H  3.637029 1.630172 -2.146705
H  -2.167353 -1.336735 -2.189861
H  -1.22559 1.331408 1.11586
H  -4.468957 -1.609132 -1.340021
H  -3.581835 1.042521 1.976876
H  3.181393 0.98818 1.540076
H  5.158746 -0.29969 -2.104568
H  -0.041158 -0.399752 -1.999691
H  4.646486 -0.555038 2.879293
H  6.620709 -1.843467 -0.77403
H  6.363983 -1.976323 1.720935
H  -6.038938 -2.191615 -0.077017
H  -7.304101 -1.535504 0.946343
