program: Gaussian 09
title: 000270414
version: EM64L-G09RevD.01
frameworkgroup: C1[X(C20H18N2O6)]
method: RPBEPBE
basis: SDD
operation: Freq
keyword: #p
keyword: freq=noraman
keyword: PBEPBE/SDD
title: #p freq=noraman PBEPBE/SDD
converged: YES YES NO NO
title: Mulliken charges:
elementType: O O O O O O N N C C C C C C C C C C C C C C C C C C C C H H H H H H H H H H H H H H H H H H
charge: -0.238869 -0.238866 -0.431221 -0.431223 -0.243585 -0.243582 -0.459697 -0.459707 0.237100 0.237100 0.315700 0.315711 -0.386270 -0.386254 -0.379865 -0.379870 -0.274243 -0.274272 0.135380 0.135381 0.249988 0.249943 -0.805577 -0.805582 -0.399246 -0.399213 0.166596 0.166589 0.195348 0.195344 0.312859 0.312844 0.234336 0.234336 0.330887 0.330892 0.271410 0.237976 0.285760 0.271416 0.237981 0.285755 0.262060 0.262042 0.383204 0.383204
chargesum: 0.00000
title: Mulliken charges with hydrogens summed into heavy atoms:
elementType: O O O O O O N N C C C C C C C C C C C C C C C C C C C C
charge: -0.238869 -0.238866 -0.048018 -0.048019 -0.243585 -0.243582 -0.128810 -0.128814 0.237100 0.237100 0.315700 0.315711 -0.190923 -0.190910 -0.067006 -0.067027 -0.039908 -0.039936 0.135380 0.135381 0.249988 0.249943 -0.010430 -0.010430 -0.137186 -0.137171 0.166596 0.166589
polarizability: 4.78316831e+02 6.23307719e+00 2.86715870e+02 -3.34406348e-03 -2.47036513e-02 1.49191047e+02
1716.lowfreq: 0.0006 0.0009 0.0009 2.9567 3.2337 8.6358 10.1577 20.7918 26.9690
frequency: 10.1425 20.7875 26.6922 38.6320 42.3629 50.4189 56.8048 70.3229 82.4903 86.5430 90.8892 118.2568 118.6658 129.1908 146.0533 171.2544 177.6393 182.9175 191.0254 216.6614 239.8162 251.4505 274.6474 311.9365 321.5825 331.3627 349.4577 359.9757 391.6859 391.8653 451.2426 458.3468 470.7957 481.0216 510.1861 525.7845 530.0183 561.7325 577.7579 578.7562 596.5575 598.2654 602.6459 638.3565 646.7680 655.1353 683.5301 685.3663 698.3340 727.5516 730.0211 732.9012 734.5769 760.4975 774.1371 781.3961 822.8717 844.8984 862.4848 864.0527 879.5915 910.0498 911.6058 912.1375 917.0691 917.8778 941.8497 989.7128 990.5016 993.2932 1001.3912 1042.9998 1043.0053 1057.9004 1059.6378 1088.4838 1093.7824 1112.7260 1134.1021 1169.9388 1202.9155 1205.7851 1219.5242 1221.3926 1257.1073 1271.3865 1271.7100 1284.4103 1285.8259 1342.6287 1370.1262 1371.4961 1391.3084 1392.0575 1400.4186 1407.2800 1435.4622 1447.0759 1447.4299 1459.8719 1466.6985 1466.7732 1481.9346 1503.7921 1542.3651 1588.2740 1590.1980 1597.3399 1602.0007 1630.2315 1636.3328 1637.4147 1638.4597 1638.5779 2982.1668 2982.1690 3060.4320 3060.4345 3118.4258 3118.8702 3138.1649 3138.1891 3142.0236 3142.0339 3156.4423 3156.8232 3197.8200 3197.9977 3523.5951 3523.6167 3547.8711 3548.1083
redmass: 8.0996 5.4383 5.3993 7.2761 7.8121 11.7101 8.2048 4.6034 4.2332 5.6154 4.3284 1.1302 1.0728 4.7308 4.1206 4.6859 4.4469 5.8976 5.5448 5.1801 5.1884 5.6602 5.0783 4.6598 4.1216 3.7003 5.7880 5.8202 6.6670 6.5399 4.8234 4.4146 3.5174 4.9983 6.8534 5.9366 4.1621 2.0907 4.0845 3.9074 1.6473 1.2171 2.4852 1.3152 1.7329 3.6602 3.5041 3.1898 3.7494 5.8917 7.2795 4.0022 1.4628 4.7130 5.8282 1.3644 4.6238 4.4238 4.9065 5.0430 4.1457 1.5627 1.8855 1.3810 3.0351 1.8506 4.8281 1.3400 1.3438 2.3519 2.1148 1.5397 1.5443 2.0130 1.9459 2.0898 2.5084 2.4509 2.2409 2.1017 1.3333 1.1846 2.0074 1.8871 1.7533 2.5674 2.4777 2.3725 2.8339 2.7600 1.5711 1.5955 1.3787 1.3506 5.7699 2.5240 2.6154 1.1251 1.0983 2.1652 1.0632 1.0650 2.3769 2.1300 3.1666 7.1529 6.3083 8.0166 3.8155 4.6614 7.0003 7.2013 6.6999 6.6568 1.0418 1.0418 1.0912 1.0912 1.0873 1.0867 1.0906 1.0906 1.0990 1.0990 1.0948 1.0948 1.0950 1.0949 1.0642 1.0642 1.0749 1.0750
irintensity: 0.3940 1.3579 0.0159 0.4357 0.3045 0.0384 0.6116 2.3022 9.2006 0.2651 2.9857 1.7776 1.9054 2.8366 0.4672 0.6399 0.1168 1.4560 1.8729 2.1812 0.6150 0.1196 0.8729 8.1149 14.5869 6.7093 8.1499 0.7941 6.5597 25.9721 4.5251 41.7057 2.7986 7.0247 0.3375 0.3810 2.4692 3.4835 38.8204 59.6663 128.7428 131.0295 15.4097 2.5283 36.8546 0.2212 12.1658 15.2348 0.1391 24.1283 43.7201 1.6428 7.2992 0.8848 6.9142 184.4861 0.0580 0.1860 0.8574 7.6515 8.4545 0.0005 41.6052 1.0051 3.6148 21.2435 5.4143 9.5948 1.6310 138.1681 243.0258 13.4037 3.1704 229.5206 267.2742 2.9673 24.6500 7.0514 51.6831 1.1483 5.1452 0.2585 5.0088 52.4573 9.2429 26.4523 41.4143 1.7529 20.3289 308.9851 21.5006 39.0777 24.1909 137.5906 2.8270 0.9468 407.7803 111.7427 35.1036 0.0386 65.5144 0.5573 478.3074 0.1342 478.5855 232.1695 6.8507 7.6384 95.7358 0.0219 558.1887 0.5035 85.7301 111.1024 0.5811 7.3387 4.0537 4.3720 37.4883 0.0093 15.2886 0.4618 8.7302 0.9111 42.8793 0.0640 14.1947 0.1682 79.9520 28.8610 0.1567 41.3185
temp: 298.150 k
press: 1.00000 atm
elementType: 8 8 8 8 8 8 7 7 6 6 6 6 6 6 6 6 6 6 6 6 6 6 6 6 6 6 6 6 1 1 1 1 1 1 1 1 1 1 1 1 1 1 1 1 1 1
symmnumber: 1
zpe: 905848.0 jmol-1
zpe.correction: 0.345019 hartree
zpe.thermalcorrener: 0.371926 hartree
zpe.thermalcorrenthalpy: 0.372870 hartree
zpe.thermalcorrgfe: 0.283724 hartree
zpe.sumelectzpe: -1331.817281 hartree
zpe.sumelectthermal: -1331.790375 hartree
zpe.sumelectthermalent: -1331.789431 hartree
zpe.sumelectthermalfe: -1331.878576 hartree
dipole: 0.0005 0.0002 0.5399
dipole: 0.5399
quadrupole: -183.0484 -161.8356 -162.3259
quadrupole: 27.1101 -0.0103 0.0009
quadrupole: -13.9785 7.2344 6.7441 27.1101 -0.0103 0.0009
hfenergy: -1332.1623004 hartree
pointgroup: C01 [X(C20H18N2O6)]
dipole: 0.0001978 0.0000699 0.2124241 debye
polarizability: 478.333175|5.9765725|286.6995259|-0.0033771|-0.0246992|149.1910474 unknown
InChI: InChI=1S/C20H18N2O6/c1-11(9-17(23)24)19(27)21-15-7-3-6-14-13(15)5-4-8-16(14)22-20(28)12(2)10-18(25)26/h3-10,21-23,25H,1-2H3
charge 0 multiplicity 1
46 atoms
O  4.106706 -2.685013 -0.538344
O  -4.106895 2.684864 -0.539358
O  6.649497 2.069762 1.815154
O  -6.649611 -2.069554 1.815478
O  8.01031 0.976607 0.279524
O  -8.010193 -0.976957 0.279249
N  3.051659 -0.58276 -0.341914
N  -3.051618 0.582833 -0.341599
C  0.70685 0.163836 -0.374381
C  -0.706814 -0.163719 -0.374204
C  1.672915 -0.923378 -0.366172
C  -1.672884 0.923488 -0.366245
C  1.098061 1.543729 -0.384486
C  -1.098032 -1.543613 -0.383722
C  1.24836 -2.262143 -0.374839
C  -1.248335 2.262253 -0.375498
C  0.140624 2.55888 -0.387313
C  -0.140601 -2.558771 -0.386314
C  4.163471 -1.426009 -0.395761
C  -4.163499 1.42598 -0.395663
C  5.50366 -0.714382 -0.295012
C  -5.503615 0.714204 -0.295109
C  6.593384 -1.31882 -1.141492
C  -6.593182 1.318257 -1.142071
C  5.641955 0.331213 0.584583
C  -5.642007 -0.331147 0.584759
C  6.884106 1.095305 0.823366
C  -6.884134 -1.095304 0.823467
H  2.151766 1.844415 -0.401382
H  -2.151742 -1.844296 -0.400349
H  1.990921 -3.060738 -0.379662
H  -1.990894 3.060844 -0.380504
H  0.456976 3.606861 -0.398737
H  -0.456957 -3.606755 -0.397289
H  3.271202 0.413663 -0.312345
H  -3.271109 -0.413588 -0.311558
H  6.552734 -2.417814 -1.036831
H  6.405883 -1.103921 -2.21233
H  7.586239 -0.933015 -0.875331
H  -6.552706 2.417286 -1.037711
H  -6.405354 1.103074 -2.212796
H  -7.586063 0.932402 -0.876081
H  4.807103 0.638078 1.22565
H  -4.807269 -0.637734 1.226107
H  7.490895 2.577715 1.972632
H  -7.490964 -2.57762 1.972832
