program: Gaussian 09
title: 000270413
version: EM64L-G09RevD.01
frameworkgroup: C1[X(C15H14N4O9)]
method: RPBEPBE
basis: SDD
operation: Freq
keyword: #p
keyword: freq=noraman
keyword: PBEPBE/SDD
title: #p freq=noraman PBEPBE/SDD
converged: YES YES NO NO
title: Mulliken charges:
elementType: O O O O O O O O O N N N N C C C C C C C C C C C C C C C H H H H H H H H H H H H H H
charge: -0.278438 -0.481828 -0.210614 -0.235648 -0.232671 -0.125615 -0.215063 -0.123333 -0.222278 -0.453482 -0.411481 -0.332279 -0.341322 -0.103693 -0.019144 -0.404509 0.292101 0.374368 0.320435 0.200819 0.184302 0.206458 0.199814 -0.244328 -0.248438 -0.244379 -0.243512 -0.774434 0.349602 0.283808 0.220539 0.234536 0.436745 0.364314 0.377728 0.280871 0.279352 0.282843 0.282365 0.298539 0.240776 0.236175
chargesum: 0.00000
title: Mulliken charges with hydrogens summed into heavy atoms:
elementType: O O O O O O O O O N N N N C C C C C C C C C C C C C C C
charge: -0.278438 -0.104099 -0.210614 -0.235648 -0.232671 -0.125615 -0.215063 -0.123333 -0.222278 -0.016737 -0.047167 -0.332279 -0.341322 0.245909 0.264664 0.050566 0.292101 0.374368 0.320435 0.200819 0.184302 0.206458 0.199814 0.036543 0.030915 0.038464 0.038853 0.001056
polarizability: 2.56095185e+02 -1.20200569e+01 1.79934713e+02 2.30535035e+01 -8.66316823e+00 2.04805555e+02
1716.lowfreq: -6.3400 -3.6191 -0.0004 0.0003 0.0006 1.4864 14.5906 17.8955 22.6265
frequency: 14.5064 17.8384 22.5516 25.7242 39.1256 52.0738 61.4688 71.3935 86.3762 97.2603 102.6510 108.8834 116.3924 124.9115 149.6594 168.3995 189.9512 198.1807 210.9639 233.1697 242.0131 260.4824 267.5486 275.7812 278.7076 281.6730 315.6099 333.7951 355.5705 361.9901 370.3530 426.1251 442.3111 451.9392 488.7121 532.4558 555.2901 566.7411 578.1403 606.8682 614.7307 621.2557 626.2550 641.4879 654.8145 685.6451 686.6623 710.3032 718.1498 729.0291 736.4055 749.6044 768.7771 810.2239 828.5268 831.9031 833.6263 839.2761 896.6633 946.2553 946.9163 970.4992 971.0648 980.4800 990.1425 1005.5297 1009.2564 1010.6274 1023.7811 1047.2415 1065.6362 1081.5917 1086.5215 1091.4085 1095.8217 1132.7068 1140.4122 1181.7473 1187.9394 1194.2869 1221.2055 1226.8664 1270.5878 1278.3486 1282.7444 1290.0860 1290.5455 1321.5964 1339.3635 1376.2784 1382.5475 1407.8710 1451.0102 1461.0317 1475.6121 1492.4096 1513.0137 1589.0925 1591.4816 1606.4574 1613.0770 1666.5061 1670.4638 1671.3832 1696.7359 1703.4257 2981.7044 3002.7799 3035.1881 3048.5187 3053.2543 3098.2719 3140.6225 3207.2243 3209.8002 3235.1960 3237.3378 3288.3077 3371.3770 3614.6884
redmass: 7.2877 10.2772 10.1915 6.5236 7.6578 7.9576 7.3002 6.5142 5.4702 6.4634 5.5061 6.2808 7.2565 5.0087 1.0635 6.4506 9.0630 4.8069 6.3097 7.6134 6.4332 9.9338 6.0303 4.1359 4.3711 1.5647 6.0025 4.3299 5.9510 4.3212 12.4950 6.9169 9.6474 8.0271 4.7896 4.9116 3.5057 4.1567 4.7390 5.4102 4.2295 3.1396 3.3952 5.3058 3.2224 8.4897 8.2002 2.6955 5.1472 3.8711 6.8218 2.4711 5.6892 2.7063 5.7553 2.0853 2.0319 1.4357 3.5044 1.3166 1.3179 3.3843 4.2497 4.8793 2.9790 3.3177 3.0702 3.1975 2.4524 1.6485 2.0633 2.7931 2.2271 1.8737 2.2251 3.7101 3.1451 2.5481 2.0220 1.8265 1.5470 2.7146 1.5395 3.3733 4.5652 1.7762 1.9666 1.3578 1.3324 1.2279 1.2389 1.5466 1.0568 1.0560 1.2404 1.3460 1.6334 7.2495 7.0752 10.0226 10.7187 9.2526 9.6901 9.7316 10.7458 10.8932 1.0573 1.0379 1.0885 1.0876 1.1008 1.0946 1.1021 1.0897 1.0898 1.1109 1.1110 1.0833 1.0813 1.0670
irintensity: 1.2655 0.4954 0.1275 0.2414 4.2611 0.1016 0.4506 0.8157 1.1820 0.8895 16.1081 5.1649 1.2391 3.2418 0.7157 3.5559 1.8220 29.5769 2.8718 2.7926 1.8737 6.9787 49.3669 2.6095 1.3902 111.8975 3.6130 39.4187 17.2591 12.4763 6.3644 13.5479 11.2498 0.6717 18.6650 7.8216 11.1690 4.6093 1.3000 20.3252 12.3933 9.9160 30.7754 7.9414 6.3003 32.6234 37.2497 11.3693 8.2551 43.4113 1.5724 38.2522 23.6067 76.3286 26.1502 66.6908 100.5620 87.2585 7.2140 0.0975 0.0768 3.9549 63.0976 76.9553 9.6552 77.6781 10.7416 30.1471 19.9536 25.1204 64.0886 51.1331 43.9823 25.0623 30.8431 78.1805 3.9035 262.5459 287.9110 153.9308 49.3661 184.8378 361.8873 230.1567 313.7333 15.1526 35.8410 36.8825 3.4739 7.0364 64.6482 8.4010 15.6423 19.9868 312.8122 488.9363 352.0495 16.2252 13.8752 113.8513 105.5014 106.9131 208.0229 129.4916 135.1773 439.7277 41.7278 5.5355 15.7602 1.5757 35.5381 5.0196 8.9953 0.1877 0.3689 0.3880 0.1239 246.4616 143.2799 20.2730
temp: 298.150 k
press: 1.00000 atm
elementType: 8 8 8 8 8 8 8 8 8 7 7 7 7 6 6 6 6 6 6 6 6 6 6 6 6 6 6 6 1 1 1 1 1 1 1 1 1 1 1 1 1 1
symmnumber: 1
zpe: 769442.9 jmol-1
zpe.correction: 0.293065 hartree
zpe.thermalcorrener: 0.319912 hartree
zpe.thermalcorrenthalpy: 0.320856 hartree
zpe.thermalcorrgfe: 0.231836 hartree
zpe.sumelectzpe: -1473.997452 hartree
zpe.sumelectthermal: -1473.970605 hartree
zpe.sumelectthermalent: -1473.969661 hartree
zpe.sumelectthermalfe: -1474.058681 hartree
dipole: 0.9827 -3.5476 8.5687
dipole: 9.3260
quadrupole: -127.9097 -145.5587 -173.0434
quadrupole: 5.6107 -1.5121 2.9582
quadrupole: 20.9276 3.2785 -24.2061 5.6107 -1.5121 2.9582
hfenergy: -1474.290517 hartree
pointgroup: C01 [X(C15H14N4O9)]
dipole: 0.4856019 -2.1596446 -2.9261938 debye
polarizability: 238.8270622|31.0067276|199.050296|19.1736849|21.2024018|202.958094 unknown
InChI: InChI=1S/C15H14N4O9/c1-7(21)28-8(6-20)13(16-14(26)18-9(22)2-3-10(18)23)17-15(27)19-11(24)4-5-12(19)25/h2-5,8,13,16-17,20H,6H2,1H3
charge 0 multiplicity 1
42 atoms
O  1.138653 2.848391 -1.031382
O  -1.3457 1.03633 -3.022234
O  -1.609908 -0.476167 1.807475
O  2.140962 1.296448 1.390859
O  0.01745 4.180188 0.524584
O  -4.286349 -1.425977 2.428839
O  -2.990572 -1.421591 -2.124134
O  4.731731 0.19656 1.974347
O  1.894379 -2.409517 -0.775721
N  -1.474706 0.238602 -0.411614
N  0.920593 0.076121 -0.190102
N  -3.246605 -1.199451 0.25477
N  2.973197 -0.787469 0.626595
C  -0.241335 0.992788 -0.185129
C  -0.119845 2.108716 -1.266257
C  -0.020573 1.607849 -2.711078
C  -2.045404 -0.454091 0.632504
C  1.984151 0.295527 0.653432
C  1.087621 3.847121 -0.023356
C  -4.23174 -1.677078 1.2113
C  -3.601655 -1.665997 -1.053182
C  4.245686 -0.751989 1.332949
C  2.848861 -2.048949 -0.034168
C  -5.205476 -2.505115 0.414073
C  -4.841135 -2.495679 -0.89489
C  4.878075 -2.09979 1.099132
C  4.068529 -2.848291 0.304705
C  2.468706 4.369483 0.264623
H  -0.27212 1.472644 0.809546
H  -0.984393 2.78923 -1.151329
H  0.782405 0.849378 -2.803971
H  0.207067 2.462876 -3.374531
H  -1.831712 0.201915 -1.384879
H  0.856648 -0.819805 -0.697208
H  -1.317836 0.485457 -3.841029
H  -6.056044 -2.990476 0.89281
H  -5.315523 -2.975349 -1.750867
H  5.847186 -2.349139 1.531166
H  4.207649 -3.861051 -0.072553
H  2.958226 3.651853 0.949137
H  2.40558 5.351726 0.755614
H  3.073079 4.430372 -0.654345
