program: Gaussian 09
title: 000270407
version: EM64L-G09RevD.01
frameworkgroup: C1[X(C9H10INO3S)]
method: RPBEPBE
basis: SDD
operation: Freq
keyword: #p
keyword: freq=noraman
keyword: PBEPBE/SDD
title: #p freq=noraman PBEPBE/SDD
converged: YES YES NO NO
title: Mulliken charges:
elementType: I S O O O N C C C C C C C C C H H H H H H H H H H
charge: 0.127272 0.920503 -0.548702 -0.543331 -0.244930 -0.434299 -0.118746 -0.196195 -0.246386 0.664954 -0.577567 -0.308481 -0.737758 0.225166 -0.794023 0.309435 0.287154 0.328145 0.268027 0.266913 0.295067 0.296626 0.246134 0.271879 0.243143
chargesum: 0.00000
title: Mulliken charges with hydrogens summed into heavy atoms:
elementType: I S O O O N C C C C C C C C C
charge: 0.127272 0.920503 -0.548702 -0.543331 -0.244930 -0.137673 -0.118746 0.113240 0.040767 0.664954 -0.577567 0.019665 0.092250 0.225166 -0.032867
polarizability: 2.42634199e+02 2.72598297e+00 1.87839735e+02 2.25768110e+00 -1.13292380e+00 8.55815721e+01
1716.lowfreq: -70.5280 -7.9690 -0.0009 0.0007 0.0008 4.3267 5.7425 29.7265 49.8240
frequency: -70.5272 29.7205 49.8102 63.2176 82.7327 101.8324 108.5841 142.5627 154.0657 176.7871 193.9183 202.1600 226.6388 242.2048 306.3618 334.0281 349.9721 376.8212 411.7683 427.8826 447.4491 539.8977 558.8568 582.5646 598.1549 637.0529 688.2353 692.5862 745.8600 786.9251 819.0226 866.6496 887.2776 908.4194 932.7964 969.4971 983.2370 997.2742 1001.0818 1008.2054 1034.6068 1068.3402 1138.5527 1219.0942 1241.4713 1289.0847 1302.4096 1350.7366 1380.4637 1382.5601 1407.4453 1420.9200 1435.0040 1453.5680 1466.4649 1505.2289 1573.8948 1580.4792 1642.4819 2990.6443 3029.2085 3075.4452 3138.7346 3154.4465 3155.7930 3179.2026 3183.6501 3185.0765 3447.4312
redmass: 1.0351 6.3881 4.3189 6.3840 8.7712 6.2539 4.2030 4.3893 1.0945 5.5147 7.9875 7.3882 6.0901 4.3337 7.4929 8.5888 5.1842 5.7205 5.5120 5.8768 3.6329 4.3740 4.6306 3.3538 5.2010 7.1108 3.9918 1.4843 3.5193 11.9161 4.6714 1.3989 3.0781 1.3789 6.1867 1.3677 2.0251 1.3362 3.3815 1.8976 1.6714 2.1879 1.3220 3.3710 1.4105 1.8830 1.1415 4.6313 1.3693 3.7449 1.0530 1.0555 1.7547 1.3713 1.0464 2.1070 6.0999 6.4895 4.9515 1.0386 1.0246 1.0982 1.0982 1.0923 1.0914 1.1071 1.1080 1.0954 1.0765
irintensity: 0.2643 5.1210 2.3893 10.3404 0.6017 4.0189 3.1564 1.2690 0.0564 1.5388 0.8960 0.7029 9.9928 0.7532 21.2567 5.1636 36.6660 4.9876 18.9466 9.6262 11.4875 2.5306 29.8844 17.1682 93.0313 14.4910 23.9839 29.1091 18.4050 74.3136 2.8373 42.4293 31.1555 10.7337 7.0694 54.0518 59.7260 5.8035 30.5160 57.5446 8.8667 60.5801 3.7011 94.2979 6.5775 81.6926 4.1054 256.2527 68.9360 31.2831 8.4306 13.7696 48.9323 66.9615 21.1322 463.9081 12.9046 135.3083 91.3848 4.4591 1.1105 11.3135 6.6156 5.4011 10.6569 0.7354 1.1093 15.3528 67.4713
temp: 298.150 k
press: 1.00000 atm
elementType: 53 16 8 8 8 7 6 6 6 6 6 6 6 6 6 1 1 1 1 1 1 1 1 1 1
symmnumber: 1
zpe: 460948.4 jmol-1
zpe.correction: 0.175566 hartree
zpe.thermalcorrener: 0.191456 hartree
zpe.thermalcorrenthalpy: 0.192400 hartree
zpe.thermalcorrgfe: 0.129774 hartree
zpe.sumelectzpe: -1037.685387 hartree
zpe.sumelectthermal: -1037.669497 hartree
zpe.sumelectthermalent: -1037.668552 hartree
zpe.sumelectthermalfe: -1037.731178 hartree
dipole: -5.3194 -1.0720 4.3631
dipole: 6.9629
quadrupole: -108.9336 -123.6028 -111.8838
quadrupole: 4.7334 19.9881 0.4610
quadrupole: 5.8732 -8.7961 2.9229 4.7334 19.9881 0.4610
hfenergy: -1037.8609527 hartree
pointgroup: C01 [X(C9H10I1N1O3S1)]
dipole: -1.9168942 0.9978629 -1.6835058 debye
dipolederiv: -0.155893 0.1544761 0.0043586 0.2109223 -0.4271179 -0.0105993 0.0027821 -0.0008292 0.0412045 2.1279546 -0.1951827 -0.0211412 -0.0764638 1.1025506 0.0076678 -0.0990573 0.0169521 1.3592159 -0.7915438 -0.0001296 -0.0094235 -0.1150421 -0.5933727 -0.133089 0.0296792 -0.0077779 -0.5515778 -0.7630401 0.0967781 0.0090234 0.1542831 -0.6216156 0.1401194 0.0141612 0.0193591 -0.5677615 -0.6783466 0.0447493 0.0033286 -0.5241906 -1.0038348 -0.0197978 -0.0213845 -0.022046 -0.3278234 -2.0650349 -0.5164241 -0.0105379 -0.6480999 -0.6325645 -0.0095926 -0.0395505 -0.0134339 -0.2967705 -0.4428761 0.0714364 -0.0287001 -0.0244815 -0.1609289 0.0008151 0.003294 0.0038857 -0.2466345 -0.1582201 0.1530283 0.0183371 -0.0516908 -0.2579905 0.0018763 -0.0002691 0.0216333 -0.0190431 -0.0148977 0.0162541 0.0212615 0.2636295 0.0104019 -0.0091269 0.0021838 -0.0400667 -0.0867079 1.3550073 0.4366911 0.0123692 -0.1861953 -0.2648594 -0.0141709 0.0120093 -0.0090868 0.1435784 -0.154378 -0.5612248 -0.0079084 -0.600078 0.9298592 0.0225485 -0.000245 0.0136764 -0.2021212 -0.3565746 -0.1401409 -0.000541 0.1811176 -0.0230218 0.0029408 0.012651 -0.0032202 -0.1329456 -0.2730758 0.028127 -0.0039644 0.014293 -0.1092165 -0.0097421 0.006133 -0.007254 -0.2647591 1.8713289 0.3340759 0.0137887 1.0484385 1.3937995 0.0376367 0.038513 0.0411649 0.1820051 -0.468368 0.0723683 0.000082 0.2319523 -0.0675551 -0.0052226 0.0117759 -0.0064083 0.0473709 0.1680561 -0.0722413 -0.0059371 -0.0151563 0.0882147 0.0040876 -0.003789 -0.0100543 0.1474538 0.1227808 0.0583146 -0.0061673 0.0315269 0.0596053 -0.00479 -0.0056003 0.0092657 0.1477314 0.1579012 0.0140312 0.0011491 0.0280294 0.0737383 0.0001729 -0.0002614 0.0016512 0.184128 0.086172 -0.0631165 0.0028079 -0.0757808 0.0165268 -0.0368981 -0.0141266 -0.0339429 0.0111251 0.1050109 0.0441172 0.0030637 0.0591877 -0.0003099 0.0363973 -0.0158958 0.0389364 0.0006443 -0.0284576 0.0148996 0.0062736 0.0175982 0.1196347 -0.0032818 0.0691078 -0.013879 0.066533 0.208668 0.0654736 -0.0014064 0.1364274 0.2733735 0.0003286 0.0051947 -0.0007799 0.2728433 0.0642785 -0.0001069 -0.0194639 0.0291842 0.0536447 -0.0986871 0.0218826 -0.0952199 -0.0282112 0.0175298 -0.050328 -0.0041133 -0.1182413 0.0078342 -0.0074507 -0.0092702 -0.0060732 0.133004 0.0660183 -0.0059262 0.0234609 0.0288303 0.0332042 0.1078579 -0.019918 0.1035475 -0.0124817 unknown
polarizability: 237.3290569|-16.3045671|193.0748085|-3.8261081|1.8475463|85.6516411 unknown
InChI: InChI=1S/C9H10INO3S/c1-6(12)11-9-4-3-7(5-8(9)10)15(2,13)14/h3-5,11H,1-2H3
charge 0 multiplicity 1
25 atoms
I  -1.250442 3.310473 0.057905
S  3.411348 -0.258731 0.110825
O  3.98677 1.175241 0.652907
O  3.756226 -1.684483 0.834624
O  -3.441364 -1.890351 -0.074158
N  -2.668084 0.331218 0.000104
C  1.525375 -0.101591 0.036688
C  0.983663 1.193291 0.050226
C  0.740287 -1.263806 0.043369
C  -1.267427 0.16237 0.015614
C  -0.41774 1.314552 0.035303
C  -0.660264 -1.129706 0.027003
C  3.95878 -0.42051 -1.719483
C  -3.675104 -0.650281 -0.039883
C  -5.085026 -0.067847 -0.037599
H  1.645644 2.063489 0.10524
H  1.209426 -2.251987 0.091144
H  -1.314617 -2.003463 0.027161
H  3.482166 -1.326566 -2.117796
H  3.637191 0.495847 -2.232887
H  5.053211 -0.511069 -1.676141
H  -2.987389 1.306933 0.020779
H  -5.274539 0.515691 0.882296
H  -5.807572 -0.894572 -0.087032
H  -5.245817 0.599153 -0.904709
