program: Gaussian 09
title: 000270399
version: EM64L-G09RevD.01
frameworkgroup: C1[X(C16H13BrO3)]
method: RPBEPBE
basis: SDD
operation: Freq
keyword: #p
keyword: freq=noraman
keyword: PBEPBE/SDD
title: #p freq=noraman PBEPBE/SDD
converged: YES YES NO NO
title: Mulliken charges:
elementType: Br O O O C C C C C C C C C C C C C C C C H H H H H H H H H H H H H
charge: -0.009044 -0.310456 -0.202434 -0.229052 0.329862 -0.556184 0.189772 -0.304354 -0.343922 0.392683 -0.431802 -0.320536 -0.649209 0.217558 0.162139 -0.326463 -0.326492 -0.220228 -0.215022 -0.219223 0.293812 0.251609 0.280172 0.257232 0.308613 0.236855 0.270251 0.228652 0.270439 0.266209 0.237388 0.234751 0.236424
chargesum: 0.00000
title: Mulliken charges with hydrogens summed into heavy atoms:
elementType: Br O O O C C C C C C C C C C C C C C C C
charge: -0.009044 -0.310456 -0.202434 -0.229052 0.329862 -0.262372 0.189772 -0.052745 -0.063750 0.392683 -0.174570 -0.011923 0.086549 0.217558 0.162139 -0.056024 -0.060283 0.017160 0.019729 0.017201
polarizability: 3.55884835e+02 -1.72255206e+01 1.96150428e+02 -6.37300397e+00 -1.21566133e+01 1.05305646e+02
1716.lowfreq: -3.6671 -3.0172 0.0001 0.0005 0.0006 3.1987 13.1844 20.7903 37.0520
frequency: 13.0808 20.7581 37.0495 47.5299 62.0972 65.3146 108.2179 116.1606 141.2259 169.2048 184.8893 221.1309 256.4133 265.4946 295.4287 309.4583 340.8201 371.5791 402.4144 408.1540 435.7539 453.2379 461.5431 501.3672 523.1978 601.0512 613.7872 622.8745 671.5933 672.5269 688.3357 699.1862 715.3133 760.9081 774.7011 795.1362 821.9497 832.8554 863.7243 878.1362 944.6067 956.4865 964.7144 988.2467 990.0781 996.7963 1000.1508 1007.6027 1011.0993 1011.2486 1032.7951 1054.7868 1087.2168 1099.8463 1123.5107 1151.5714 1166.7098 1175.7820 1182.9265 1208.3624 1234.4853 1242.4693 1303.0076 1315.7294 1332.1511 1374.1977 1391.3229 1393.9959 1419.8262 1438.9843 1455.4287 1460.5070 1476.0105 1488.5039 1557.0534 1582.7126 1585.4224 1609.8232 1615.2423 1635.0090 2991.2250 3075.4692 3088.7736 3129.5565 3133.8220 3146.2584 3152.9968 3158.0002 3158.3664 3170.0148 3174.8409 3184.1656 3214.9145
redmass: 5.9459 6.7683 7.1265 4.8651 6.7194 4.9820 8.8649 7.2617 6.4537 5.4119 6.3864 1.0662 3.4663 4.3661 5.8244 6.5752 7.3418 5.6901 2.8169 2.9323 3.8170 5.4095 7.8549 4.4428 3.3041 6.7618 6.4403 6.9910 5.7275 5.6055 3.9670 1.6327 4.3376 3.8659 7.2932 2.0930 6.1690 1.4204 1.2456 1.5035 4.3899 1.4189 1.3804 1.5683 5.7154 1.3888 5.3862 1.3846 1.4070 2.4048 2.1176 1.4145 1.5808 2.3007 1.3293 2.0867 1.5364 1.0561 1.1382 1.5641 3.3349 2.6017 1.3573 1.3197 1.7385 5.5145 9.9755 1.2120 4.0788 2.2487 1.0442 1.0525 2.2409 2.4830 8.5524 7.3042 6.5181 6.1231 6.6877 11.3680 1.0401 1.0867 1.0933 1.1011 1.0858 1.0892 1.0880 1.0941 1.0912 1.0986 1.0969 1.0969 1.0946
irintensity: 0.4104 0.5664 0.3063 0.0660 2.0675 0.8544 2.2253 0.2770 1.3105 1.2538 4.1732 0.2684 3.5046 1.4721 12.1020 11.6282 0.1396 6.1959 0.0016 0.2707 1.1292 7.2013 2.3936 11.7104 32.7933 1.5282 1.8481 1.0642 25.1132 20.4827 5.4167 88.3381 5.1336 9.4926 9.7507 24.7435 6.5127 14.6882 0.0430 53.0213 153.9791 3.5215 4.3273 50.7858 18.4575 0.1605 237.7601 5.7620 13.7769 125.6286 101.1925 11.2161 8.5835 12.5753 17.3316 685.7696 37.6601 0.5713 59.6720 201.2679 427.1134 79.4156 2.9614 0.5148 69.3678 49.1664 4.6482 33.4153 12.3389 15.7326 13.2834 22.6401 5.0943 58.4669 118.6816 126.6566 58.1404 48.8212 61.6491 174.1194 12.6129 6.0490 19.8670 8.4897 0.1371 8.7694 8.7703 14.4901 1.4733 24.8754 3.9935 7.6627 3.0066
temp: 298.150 k
press: 1.00000 atm
elementType: 35 8 8 8 6 6 6 6 6 6 6 6 6 6 6 6 6 6 6 6 1 1 1 1 1 1 1 1 1 1 1 1 1
symmnumber: 1
zpe: 646392.7 jmol-1
zpe.correction: 0.246198 hartree
zpe.thermalcorrener: 0.264601 hartree
zpe.thermalcorrenthalpy: 0.265545 hartree
zpe.thermalcorrgfe: 0.195344 hartree
zpe.sumelectzpe: -855.233005 hartree
zpe.sumelectthermal: -855.214602 hartree
zpe.sumelectthermalent: -855.213658 hartree
zpe.sumelectthermalfe: -855.283859 hartree
dipole: 3.9174 -2.9566 2.6875
dipole: 5.5955
quadrupole: -104.3511 -126.7849 -126.3388
quadrupole: -4.9864 -10.1124 -2.1766
quadrupole: 14.8072 -7.6267 -7.1805 -4.9864 -10.1124 -2.1766
hfenergy: -855.4792031 hartree
pointgroup: C01 [X(C16H13Br1O3)]
dipole: 1.6717047 0.7427869 1.2247446 debye
polarizability: 356.995807|9.3299465|108.1065456|-8.1113758|-19.9266248|192.2385572 unknown
InChI: InChI=1S/C16H13BrO3/c1-11(17)15(18)12-7-9-14(10-8-12)20-16(19)13-5-3-2-4-6-13/h2-11H,1H3
charge 0 multiplicity 1
33 atoms
Br -5.150074 -1.924399 2.087191
O  1.391137 -0.046732 0.156788
O  -4.941389 -0.239275 -1.189928
O  2.032851 0.159738 -2.103796
C  -2.846262 -0.134502 -0.002194
C  -5.17152 -0.048635 1.2154
C  -4.339908 -0.161874 -0.078447
C  -2.123276 -0.091677 1.223146
C  -2.116359 -0.143845 -1.221877
C  -0.01729 -0.063955 -0.009455
C  -0.719627 -0.058825 1.219905
C  -0.71032 -0.106331 -1.246799
C  -6.616015 0.377165 0.981979
C  3.725974 0.01046 -0.356868
C  2.340003 0.051578 -0.896444
C  4.793178 0.122016 -1.288301
C  4.006808 -0.137564 1.027426
C  6.12776 0.086573 -0.838801
C  5.345036 -0.173297 1.471099
C  6.406399 -0.061181 0.541479
H  -4.670494 0.571535 1.975513
H  -2.644946 -0.112039 2.18457
H  -2.682058 -0.180414 -2.158601
H  -0.149516 -0.035484 2.152941
H  -0.164604 -0.105065 -2.189935
H  -7.18822 0.35822 1.923684
H  -7.100696 -0.27572 0.239768
H  -6.629451 1.408605 0.579075
H  4.554136 0.234557 -2.350882
H  3.179664 -0.224732 1.736351
H  6.948796 0.172909 -1.558209
H  5.562105 -0.288967 2.53827
H  7.444674 -0.089342 0.890353
