program: Gaussian 09
title: 000275928
version: EM64L-G09RevD.01
frameworkgroup: C1[X(C8H13IN4)]
method: RPBEPBE
basis: SDD
operation: Freq
keyword: #p
keyword: freq=noraman
keyword: PBEPBE/SDD
title: #p freq=noraman PBEPBE/SDD
converged: NO YES NO NO
title: Mulliken charges:
elementType: I N N N N C C C C C C C C H H H H H H H H H H H H H
charge: 0.045262 -0.216141 -0.056616 -0.145639 -0.098065 -0.015380 -0.641996 -0.421301 -0.319646 -0.388008 -0.407108 0.259642 -0.727567 0.259498 0.328575 0.219686 0.246539 0.237082 0.222549 0.197145 0.220011 0.211265 0.218869 0.259140 0.235477 0.276726
chargesum: 0.00000
title: Mulliken charges with hydrogens summed into heavy atoms:
elementType: I N N N N C C C C C C C C
charge: 0.045262 -0.216141 -0.056616 -0.145639 -0.098065 0.244119 -0.313421 0.044924 0.139985 0.029149 0.023027 0.259642 0.043776
polarizability: 1.35531618e+02 1.29282215e+01 1.47100092e+02 9.16268610e-01 -5.94098492e+00 1.06932656e+02
1716.lowfreq: -15.6991 -8.7613 -0.0005 -0.0004 -0.0004 7.2509 45.2298 57.3594 76.5696
frequency: 45.1467 57.0989 76.4968 120.5425 131.1124 159.3936 176.6566 205.2771 253.7039 279.8924 311.8817 343.8286 404.4579 412.7021 457.4668 496.3560 638.4169 663.8628 673.4610 680.6789 746.3128 803.1178 836.3175 863.5983 897.9413 904.4676 940.1576 949.1059 968.7936 1000.6189 1016.1795 1044.8961 1054.3999 1056.9827 1088.0947 1103.2307 1124.1648 1138.1342 1179.3630 1204.9413 1212.5449 1245.4401 1257.2785 1280.3230 1310.7033 1316.4066 1322.2173 1337.3013 1345.5309 1355.1150 1370.7558 1401.4059 1463.7715 1465.9260 1468.8346 1472.3000 1473.2576 1477.6615 1492.4399 2975.4437 2985.2837 2993.5421 2995.1848 2999.6132 3017.2110 3044.3598 3050.6319 3062.4237 3066.3214 3074.5990 3080.9859 3125.1975
redmass: 5.3778 6.6404 3.6386 3.3591 1.0762 4.5174 5.3269 2.8333 4.0623 4.0911 1.8046 2.9653 3.6975 3.7801 2.9435 2.4829 2.9354 4.1251 7.7136 9.2383 3.1453 1.8588 2.2282 1.5126 3.4952 4.1764 2.6015 2.5018 2.2765 2.6671 6.0199 1.6464 1.4857 1.6655 1.7786 2.4453 1.7799 3.9913 1.6435 2.1670 2.6283 1.3171 1.3495 1.2779 1.2710 1.2948 1.2833 1.3997 1.4812 3.1071 1.6987 1.2162 1.0877 1.0888 1.1715 1.0866 1.0777 1.0990 5.1193 1.0648 1.0622 1.0384 1.0636 1.0610 1.0849 1.0960 1.1005 1.0953 1.1028 1.0983 1.0932 1.0975
irintensity: 4.9004 0.4830 1.8863 2.0137 0.1629 0.3040 3.2800 1.8420 0.7085 3.0582 0.0396 0.8629 1.8688 2.8891 3.2671 3.1093 30.3688 6.7787 0.3214 0.0999 1.8954 0.6975 13.5116 8.5990 6.5670 3.2194 3.6941 11.5691 19.6538 14.8834 7.1547 1.4898 4.8843 0.4833 9.9284 0.3396 5.9258 4.7173 28.3700 0.6234 0.8558 5.6439 7.9324 2.9613 6.5792 9.8817 2.1018 0.0812 0.1388 47.2074 26.6896 19.9007 8.7205 7.7748 4.3997 14.8090 25.0722 2.8468 33.1073 32.0813 30.1002 11.2998 13.4267 18.1211 6.7503 43.4780 39.8291 19.4718 13.2373 8.0255 18.0731 3.9253
temp: 298.150 k
press: 1.00000 atm
elementType: 53 7 7 7 7 6 6 6 6 6 6 6 6 1 1 1 1 1 1 1 1 1 1 1 1 1
symmnumber: 1
zpe: 550576.9 jmol-1
zpe.correction: 0.209704 hartree
zpe.thermalcorrener: 0.222436 hartree
zpe.thermalcorrenthalpy: 0.223380 hartree
zpe.thermalcorrgfe: 0.168630 hartree
zpe.sumelectzpe: -542.125832 hartree
zpe.sumelectthermal: -542.113100 hartree
zpe.sumelectthermalent: -542.112156 hartree
zpe.sumelectthermalfe: -542.166906 hartree
dipole: 5.0225 3.0493 4.7097
dipole: 7.5304
quadrupole: -108.6806 -87.8231 -93.9397
quadrupole: 4.9408 -13.3330 1.3077
quadrupole: -11.8662 8.9913 2.8748 4.9408 -13.3330 1.3077
hfenergy: -542.3355359 hartree
pointgroup: C01 [X(C8H13I1N4)]
dipole: 2.3405547 -0.359148 -1.7805116 debye
dipolederiv: -0.2063764 0.1839549 0.0050649 0.1894632 -0.5158973 -0.0579426 -0.0469355 0.0298724 -0.1032569 -0.6234411 -0.0588249 0.0574762 -0.0812288 -0.1390941 0.0711761 0.2447312 0.0803931 -0.3062548 -0.146841 0.0982926 -0.2766702 0.1306698 -0.0859873 -0.0211972 -0.4048619 -0.0851038 -0.0176361 -0.3023741 -0.0709333 0.1089752 0.0048261 -0.1918082 0.0774062 -0.0540852 0.0944212 -0.4168267 -0.1433583 -0.0724017 0.1081 -0.0204303 -0.150784 -0.0870842 0.0650351 -0.0936655 0.0952607 0.5502073 0.2702009 0.0080666 0.071453 -0.0144046 -0.0181959 -0.0979479 0.1338339 0.1761168 0.1701994 -0.3609986 0.0140296 -0.2676711 0.8741289 0.0204777 0.060939 -0.0340332 0.0257706 -0.0117689 -0.1998016 -0.012138 -0.0517841 0.065702 0.0289632 0.0167536 -0.1079001 0.0798417 -0.0075097 0.0170698 0.013607 0.1558204 -0.2132091 -0.0283773 -0.110947 0.0198797 0.1212481 0.049349 -0.0177735 -0.0086452 0.0649575 0.0466494 -0.0534173 -0.0481992 0.0039145 0.1541759 0.0013455 0.1014245 -0.0211295 -0.090823 0.1742529 -0.0145022 0.0613842 -0.0713432 0.1327911 0.4743038 0.0751855 -0.0213927 -0.0705929 0.0820706 -0.1086501 0.2408099 -0.0555966 0.3603428 0.010698 -0.0344246 0.0189688 -0.0020974 0.0396216 0.0632546 -0.0441121 0.0619239 -0.101653 0.0156965 -0.0130393 -0.0020156 0.0004993 0.0554129 0.0512923 0.0238501 0.0292233 -0.064023 0.0500991 0.0549282 0.0045722 0.0223149 -0.0787283 0.0786306 0.0143453 -0.000699 0.0053981 -0.0255781 -0.0472317 -0.0701796 -0.0599588 -0.0895129 -0.069108 -0.0789477 -0.0979235 0.0102511 0.0740488 0.018709 0.0252398 0.0067509 0.076189 0.0085118 0.0383502 0.0668114 -0.0650282 -0.002101 -0.052438 -0.0398273 -0.0831483 -0.0273258 -0.0750787 -0.0580431 -0.0902147 0.0170843 0.0525876 0.0327608 -0.0086668 0.0066145 0.062101 0.0439537 0.0546202 0.0679224 -0.1128298 0.0261867 -0.021939 -0.0068055 -0.0550471 0.0674729 0.0906779 0.0392315 0.016729 -0.1652926 -0.0149634 0.0866777 0.0013584 0.1037055 -0.1617355 -0.0112507 -0.0076116 0.0118419 0.0816816 0.1050711 -0.0293161 0.0443871 0.0024019 0.0137164 0.0470544 -0.0267723 0.0558795 -0.14643 -0.2130195 0.0194485 0.02677 0.0215015 -0.0008798 -0.0081051 0.0624554 -0.015246 0.0760859 0.090087 -0.0832265 0.0296914 -0.0681256 -0.0259707 0.0462892 0.0157946 0.0029194 0.0709666 0.077596 0.0836088 0.0807307 0.0684344 0.01146 -0.0826579 0.0397168 -0.0306115 -0.0107942 -0.0501441 0.0200875 -0.0795676 0.0014946 0.12656 0.0078795 0.0004467 0.0067715 0.1030102 unknown
polarizability: 144.6385954|-13.6106706|138.5840683|1.8096161|-4.2966212|106.3417015 unknown
InChI: InChI=1S/C8H13IN4/c1-6-10-11-12-13(6)8-5-3-2-4-7(8)9/h7-8H,2-5H2,1H3
charge 0 multiplicity 1
26 atoms
I  0.430675 2.937921 0.230324
N  -0.905266 -0.215101 0.012074
N  -1.251143 -0.627435 1.315117
N  -3.124408 -0.214764 0.10515
N  -2.596507 -0.619482 1.350848
C  0.516948 -0.138318 -0.372957
C  1.291491 0.879961 0.493627
C  1.165447 -1.550512 -0.246742
C  2.790573 0.911598 0.151381
C  2.668887 -1.521252 -0.594139
C  3.414363 -0.502536 0.295452
C  -2.056411 0.031292 -0.703554
C  -2.131864 0.505698 -2.11837
H  0.552975 0.188969 -1.429295
H  1.110967 0.677878 1.56265
H  0.618262 -2.247586 -0.908928
H  1.0195 -1.904925 0.790507
H  3.303558 1.632475 0.811993
H  2.928019 1.269584 -0.887753
H  2.806701 -1.250653 -1.661369
H  3.094681 -2.533526 -0.464236
H  3.366296 -0.827602 1.353922
H  4.48456 -0.453243 0.020989
H  -1.63163 1.483549 -2.238576
H  -1.666807 -0.209899 -2.820651
H  -3.192167 0.618909 -2.389764
