program: Gaussian 09
title: 000275934
version: EM64L-G09RevD.01
frameworkgroup: C1[X(C15H19NO)]
method: RPBEPBE
basis: SDD
operation: Freq
keyword: #p
keyword: freq=noraman
keyword: PBEPBE/SDD
title: #p freq=noraman PBEPBE/SDD
converged: YES YES NO NO
title: Mulliken charges:
elementType: O N C C C C C C C C C C C C C C C H H H H H H H H H H H H H H H H H H H
charge: -0.243392 -0.198342 -0.084126 -0.117100 -0.428593 -0.449072 -0.414436 -0.397617 -0.399037 -0.372245 0.055116 0.260839 -0.337290 -0.348558 -0.240627 -0.225529 -0.227641 0.249508 0.239733 0.225948 0.195308 0.208845 0.219525 0.216025 0.204821 0.195981 0.200354 0.192991 0.196164 0.211204 0.192052 0.256714 0.272504 0.228545 0.230788 0.230639
chargesum: 0.00000
title: Mulliken charges with hydrogens summed into heavy atoms:
elementType: O N C C C C C C C C C C C C C C C
charge: -0.243392 -0.198342 0.165382 0.122634 -0.007336 -0.020702 0.006410 -0.001283 -0.009881 0.031011 0.055116 0.260839 -0.080576 -0.076055 -0.012082 0.005259 0.002998
polarizability: 2.25938209e+02 7.19270735e+00 1.67864151e+02 5.36512049e+00 -1.00363198e+01 1.09744101e+02
1716.lowfreq: -12.2131 -2.7586 0.0003 0.0007 0.0008 4.9560 35.2841 40.5400 52.2154
frequency: 35.0831 40.4439 52.1958 79.7776 121.9586 152.5326 177.3377 197.1714 222.0877 254.9033 276.7045 295.4532 328.9678 345.2459 386.6799 405.4138 433.8534 465.6121 495.3350 505.7131 610.0102 614.7937 626.2638 679.2101 687.1773 705.4271 752.3738 758.5910 782.6267 796.9255 804.3849 821.9162 849.2169 861.9174 905.3309 917.4271 946.7853 969.4957 988.8594 991.0408 992.6587 1005.6699 1007.0355 1024.6746 1028.7949 1055.5703 1079.2372 1081.8864 1104.2172 1119.0276 1144.2876 1149.1913 1162.2606 1172.3691 1173.8864 1180.9025 1213.2003 1242.2131 1250.2207 1274.5816 1276.7836 1311.6397 1315.0155 1320.8133 1337.9277 1346.0184 1353.9945 1356.0317 1362.1783 1382.1750 1386.6185 1421.7071 1434.9294 1457.1363 1462.1427 1467.2456 1469.9251 1474.7461 1477.8351 1506.5512 1554.5186 1595.3835 1609.8494 2956.7059 2961.6204 2972.8932 2977.3792 2985.6675 2994.2220 3008.6333 3011.3753 3027.6718 3034.7957 3043.4113 3054.3114 3056.5619 3077.4247 3126.6767 3138.7133 3152.4763 3163.9131 3172.4358
redmass: 3.6697 3.6695 4.0712 4.5244 3.1689 4.0555 3.7295 3.8598 3.0835 3.7336 2.6342 2.4943 2.6959 3.3811 2.6509 2.8337 2.9847 2.9286 3.5841 2.2957 3.1388 6.0496 3.1197 5.2652 4.7734 1.5110 2.3927 2.4932 1.9325 2.2769 1.9869 2.1223 2.4276 1.2585 2.5357 2.2542 1.4742 2.3191 1.9626 2.6380 1.7279 1.4396 1.9795 2.1650 1.9636 1.3629 1.5560 1.5339 2.0710 2.3527 2.3165 1.6376 1.4800 1.0699 1.3473 1.1250 1.3163 1.4207 1.8104 1.1880 1.1878 1.3504 1.5304 1.6300 1.3961 1.3731 1.6896 1.4004 1.4091 1.4265 8.2284 2.4396 2.2505 1.0846 1.1043 1.0858 1.0927 1.0948 2.2586 1.0818 10.0189 6.8614 6.0760 1.0603 1.0604 1.0616 1.0639 1.0674 1.0676 1.0983 1.1005 1.0976 1.0997 1.0859 1.0970 1.0886 1.0932 1.0851 1.0890 1.0934 1.0962 1.0987
irintensity: 0.4024 0.0440 1.0397 1.7590 1.4490 2.6764 0.2057 3.1013 6.2859 4.2897 2.0197 0.2111 0.9400 4.1902 5.0164 0.0237 4.3006 1.7300 8.7271 2.0857 3.0986 0.3954 12.1431 4.4785 3.5169 86.4721 3.9226 8.2090 9.5856 11.2175 8.8630 18.2418 4.5093 1.4945 7.6439 2.7861 4.3241 10.4944 1.0205 0.1792 9.1035 3.1037 5.6064 9.0865 1.8691 13.5781 19.6275 0.5632 3.7591 38.2896 2.1743 1.6515 1.3667 0.4016 18.2872 29.1462 2.5573 36.2303 103.6246 1.5150 25.6904 30.6254 128.1319 117.1148 4.6534 2.8933 17.7890 3.9483 0.1370 20.1342 1.7407 153.9839 19.5383 8.4335 13.2683 16.3501 9.2975 13.2634 6.7728 20.4459 181.0457 28.3398 8.9657 32.1050 21.8092 25.5111 61.1092 55.1773 45.2842 25.2487 19.9703 38.0700 79.6078 2.2631 68.9453 12.2833 51.9373 0.0317 11.9825 18.1758 25.4882 11.3193
temp: 298.150 k
press: 1.00000 atm
elementType: 8 7 6 6 6 6 6 6 6 6 6 6 6 6 6 6 6 1 1 1 1 1 1 1 1 1 1 1 1 1 1 1 1 1 1 1
symmnumber: 1
zpe: 803903.6 jmol-1
zpe.correction: 0.306191 hartree
zpe.thermalcorrener: 0.321421 hartree
zpe.thermalcorrenthalpy: 0.322366 hartree
zpe.thermalcorrgfe: 0.262985 hartree
zpe.sumelectzpe: -711.668853 hartree
zpe.sumelectthermal: -711.653622 hartree
zpe.sumelectthermalent: -711.652678 hartree
zpe.sumelectthermalfe: -711.712059 hartree
dipole: 1.5219 -3.5450 -0.7062
dipole: 3.9219
quadrupole: -88.5780 -106.2499 -102.1616
quadrupole: 6.6101 0.9212 -2.2778
quadrupole: 10.4185 -7.2534 -3.1651 6.6101 0.9212 -2.2778
hfenergy: -711.9750439 hartree
pointgroup: C01 [X(C15H19N1O1)]
dipole: -0.6648311 -0.1495946 1.384379 debye
polarizability: 224.331509|8.8667233|120.169127|12.844599|-23.2882511|159.0458257 unknown
InChI: InChI=1S/C15H19NO/c17-15(12-8-4-3-5-9-12)16-13-10-6-1-2-7-11-14(13)16/h3-5,8-9,13-14H,1-2,6-7,10-11H2
charge 0 multiplicity 1
36 atoms
O  1.204947 0.913402 -2.362371
N  -0.234259 -0.024426 -0.776674
C  -1.492144 0.676782 -1.130407
C  -1.056821 0.531709 0.350777
C  -2.601827 -0.061247 -1.884776
C  -1.636638 -0.430128 1.380874
C  -3.235145 -1.307967 -1.224276
C  -3.043735 -0.030152 1.892958
C  -4.350672 -0.992885 -0.1820
C  -4.106416 0.191772 0.78959
C  1.042139 0.374346 -1.224733
C  2.192039 0.051125 -0.313843
C  2.064344 -0.835868 0.787046
C  3.450962 0.645348 -0.590121
C  3.180438 -1.115643 1.604747
C  4.563608 0.368247 0.230539
C  4.43057 -0.511616 1.331748
H  -1.315802 1.68408 -1.542336
H  -0.669385 1.469506 0.781944
H  -2.167385 -0.345586 -2.863321
H  -3.400214 0.675782 -2.108875
H  -0.940879 -0.471608 2.243635
H  -1.663959 -1.446466 0.955147
H  -2.43507 -1.935483 -0.793044
H  -3.693192 -1.924608 -2.022854
H  -2.965139 0.897469 2.496692
H  -3.394015 -0.821551 2.586199
H  -4.567535 -1.909905 0.404432
H  -5.278315 -0.764651 -0.746127
H  -3.846021 1.094361 0.203252
H  -5.067255 0.426593 1.290796
H  1.104506 -1.32512 0.977599
H  3.529648 1.311488 -1.455699
H  3.080496 -1.809264 2.447045
H  5.532494 0.83123 0.01318
H  5.296332 -0.731064 1.966857
