program: Gaussian 09
title: 000270379
version: EM64L-G09RevD.01
frameworkgroup: C1[X(C14H14N2O4)]
method: RPBEPBE
basis: SDD
operation: Freq
keyword: #p
keyword: freq=noraman
keyword: PBEPBE/SDD
title: #p freq=noraman PBEPBE/SDD
converged: YES YES NO NO
title: Mulliken charges:
elementType: O O O O N N C C C C C C C C C C C C C C H H H H H H H H H H H H H H
charge: -0.231738 -0.419142 -0.276212 -0.230707 -0.354455 -0.000293 -0.328181 -0.214223 -0.178600 -0.239687 -0.210444 -0.205545 0.262002 0.153916 -0.550526 0.472889 -0.297540 -0.493147 -0.194702 -0.327927 0.299265 0.322856 0.259502 0.292408 0.246396 0.256189 0.305600 0.226895 0.265869 0.384158 0.280496 0.244980 0.234382 0.245267
chargesum: 0.00000
title: Mulliken charges with hydrogens summed into heavy atoms:
elementType: O O O O N N C C C C C C C C C C C C C C
charge: -0.231738 -0.034984 -0.276212 -0.230707 -0.048854 -0.000293 -0.028916 0.108633 0.080902 0.052721 0.035952 0.050643 0.262002 0.153916 -0.057762 0.472889 -0.017044 -0.248167 0.039679 -0.082660
polarizability: 2.12023851e+02 8.52832174e+00 1.56990215e+02 1.98643478e+01 -1.88097953e+01 1.20885448e+02
1716.lowfreq: -16.9623 -9.3751 -7.0757 -0.0006 -0.0005 -0.0005 15.6951 24.2027 28.8269
frequency: 10.3232 23.9826 28.7077 34.2410 51.9914 82.0194 114.0624 130.0986 154.6689 197.5515 234.1467 251.3978 304.4960 317.7268 347.3485 387.5927 404.2209 423.2196 478.5648 492.5862 527.4233 546.8929 560.9996 608.7534 614.9533 631.3109 645.9747 662.2190 697.3460 724.6377 729.0238 736.5147 779.4893 793.5441 801.3149 824.7987 834.5888 862.6229 876.6885 910.8341 920.3544 924.1310 930.8955 951.1506 965.1368 970.6067 975.8268 995.4315 999.6985 1012.9111 1017.0244 1027.8493 1068.6998 1084.2462 1097.5266 1116.9365 1147.5183 1174.0758 1190.8975 1201.5510 1208.0103 1215.1555 1229.9144 1242.1543 1251.6681 1263.2738 1291.3623 1301.1329 1304.7703 1312.4936 1338.2786 1346.6028 1356.2839 1417.7636 1447.1095 1460.8970 1486.4850 1558.6147 1584.0128 1586.8370 1607.9377 1655.9626 2992.9201 3010.5729 3056.9479 3072.6830 3106.0015 3123.6085 3130.8914 3140.3050 3151.1270 3164.8522 3185.7804 3217.6390 3508.3794 3545.6989
redmass: 5.8974 5.7347 5.7449 8.9083 6.1223 6.5923 4.9642 5.3500 5.1577 4.9948 5.8344 5.5191 5.9274 2.9191 4.1783 2.8266 3.6639 4.7081 3.3486 3.4787 2.1493 1.8708 3.2049 6.0312 3.1692 4.0062 3.8496 1.9548 2.3416 2.8707 2.5532 3.7141 5.7045 3.2643 4.8839 2.9902 2.1468 3.9983 3.4107 1.8589 2.9690 1.4448 2.3064 1.4654 2.3339 4.3154 3.2845 1.9271 2.0532 3.0883 2.6911 3.0087 2.2957 2.0055 1.5129 1.6128 1.1704 1.4182 1.5377 1.4563 1.2963 1.3178 1.8969 1.3013 1.3914 1.4645 1.7109 1.8077 1.9453 5.8685 1.3223 1.5952 1.3185 2.0530 1.1874 2.0006 1.8436 5.5240 6.1898 5.7190 6.5286 9.2840 1.0819 1.0594 1.0849 1.1036 1.0912 1.0915 1.0879 1.0930 1.0931 1.1001 1.0882 1.1113 1.0639 1.0780
irintensity: 0.2294 0.2719 4.5259 0.5810 3.0776 5.5409 6.7251 4.0066 0.3097 2.8828 10.7825 0.3138 7.7019 4.3821 2.6616 4.9724 9.3764 2.0759 7.7602 31.4009 75.0193 10.3345 22.6007 20.1748 37.8171 35.1793 17.8709 92.9713 36.0595 31.3011 14.7523 7.4903 16.3030 21.2592 4.3233 99.5618 21.8664 8.7898 11.0868 6.8841 9.3916 2.1883 4.9533 3.7651 2.6734 4.4709 53.9178 4.9790 2.6355 15.2681 22.1965 1.4428 23.0269 174.1001 1.0576 12.8434 15.1828 27.1685 18.5463 41.3019 4.2569 6.0996 8.7388 19.4647 18.0722 41.8011 10.3692 23.1287 34.7401 7.6577 0.9161 19.1556 11.4819 27.3316 36.5909 5.8621 232.3488 4.4471 3.5771 1.7456 121.9841 282.5236 28.1782 32.2340 3.2065 4.2789 25.3180 21.1176 4.3658 10.4715 4.0162 20.4433 2.3053 5.5303 22.8826 19.2573
temp: 298.150 k
press: 1.00000 atm
elementType: 8 8 8 8 7 7 6 6 6 6 6 6 6 6 6 6 6 6 6 6 1 1 1 1 1 1 1 1 1 1 1 1 1 1
symmnumber: 1
zpe: 684775.2 jmol-1
zpe.correction: 0.260817 hartree
zpe.thermalcorrener: 0.278089 hartree
zpe.thermalcorrenthalpy: 0.279034 hartree
zpe.thermalcorrgfe: 0.211537 hartree
zpe.sumelectzpe: -950.800868 hartree
zpe.sumelectthermal: -950.783595 hartree
zpe.sumelectthermalent: -950.782651 hartree
zpe.sumelectthermalfe: -950.850148 hartree
dipole: 1.1099 -1.1117 0.4137
dipole: 1.6245
quadrupole: -142.9719 -102.8867 -119.6702
quadrupole: 10.7529 -2.5943 -10.8764
quadrupole: -21.1290 18.9563 2.1727 10.7529 -2.5943 -10.8764
hfenergy: -951.0616849 hartree
pointgroup: C01 [X(C14H14N2O4)]
dipole: -0.4228133 0.3706945 0.303819 debye
polarizability: 211.1485753|14.3605612|142.2763278|-18.5650997|25.516931|136.4746106 unknown
InChI: InChI=1S/C14H14N2O4/c17-13(16-7-8-2-1-5-15-6-8)11-9-3-4-10(20-9)12(11)14(18)19/h1-6,9-12,16,18H,7H2
charge 0 multiplicity 1
34 atoms
O  2.734104 -1.827763 0.830271
O  3.591313 2.052502 0.803847
O  0.165629 1.112393 -1.340152
O  5.140193 0.734769 -0.308539
N  -0.675216 1.210751 0.824805
N  -5.28019 0.063967 1.010725
C  1.517158 0.158762 0.490775
C  2.749984 0.157062 -0.465201
C  1.306271 -1.409639 0.718725
C  3.095782 -1.385739 -0.557583
C  0.882135 -2.045675 -0.60948
C  1.992607 -2.034603 -1.395422
C  0.297922 0.871503 -0.099035
C  3.949841 0.958642 0.000997
C  -1.937366 1.869947 0.431019
C  -3.09485 0.895623 0.249708
C  -3.087574 -0.061666 -0.7985
C  -4.215192 0.914212 1.116381
C  -4.17935 -0.945869 -0.926696
C  -5.24762 -0.850834 -0.002101
H  1.78621 0.604134 1.462722
H  2.443064 0.558462 -1.45222
H  0.756168 -1.684785 1.627478
H  4.144646 -1.616533 -0.773779
H  -0.131778 -2.358001 -0.863694
H  2.090849 -2.328751 -2.441289
H  -0.535445 0.966254 1.807016
H  -2.193145 2.628364 1.192994
H  -1.727348 2.389811 -0.520869
H  4.413465 2.565342 1.034778
H  -2.244273 -0.092272 -1.49801
H  -4.272057 1.643959 1.935349
H  -4.212671 -1.691453 -1.72749
H  -6.111668 -1.521875 -0.067729
