program: Gaussian 09
title: 000275931
version: EM64L-G09RevD.01
frameworkgroup: C1[X(C17H20N2O2)]
method: RPBEPBE
basis: SDD
operation: Freq
keyword: #p
keyword: freq=noraman
keyword: PBEPBE/SDD
title: #p freq=noraman PBEPBE/SDD
converged: YES YES NO NO
title: Mulliken charges:
elementType: O O N N C C C C C C C C C C C C C C C C C H H H H H H H H H H H H H H H H H H H H
charge: -0.315411 -0.300940 -0.442960 -0.494550 -0.048341 -0.198225 0.476378 -0.706094 -0.435312 -0.366216 0.289955 -0.218572 -0.228880 -0.508550 -0.239922 0.477494 -0.454356 -0.345080 -0.198579 -0.215340 -0.263192 0.271784 0.185989 0.203705 0.246941 0.226603 0.310318 0.229607 0.238869 0.226645 0.225400 0.207182 0.229458 0.229249 0.229687 0.285770 0.211884 0.308385 0.221655 0.222409 0.225154
chargesum: 0.00000
title: Mulliken charges with hydrogens summed into heavy atoms:
elementType: O O N N C C C C C C C C C C C C C C C C C
charge: -0.315411 -0.300940 -0.132642 -0.208780 0.223443 -0.012236 0.476378 -0.028844 -0.205705 -0.127348 0.289955 0.008074 -0.003481 0.157338 -0.010235 0.477494 -0.242473 -0.036695 0.023076 0.007069 -0.038038
polarizability: 2.50743499e+02 -2.05036822e+01 1.77485881e+02 -1.86072816e+01 -1.43801069e+00 1.86447143e+02
1716.lowfreq: -11.7566 -0.0006 -0.0003 0.0006 1.2168 2.6110 10.2914 16.8855 32.4556
frequency: -5.5572 16.1424 32.2516 50.4478 57.2552 79.9763 85.7202 103.0763 114.3190 147.9680 164.2463 198.0620 229.8480 232.3839 239.0271 249.3627 268.0538 298.6292 335.7942 356.3856 403.6587 406.8488 415.1389 421.4180 469.1640 516.4829 529.3453 582.9687 600.9006 611.1769 614.9448 616.1695 637.7924 695.7807 704.4037 706.5707 748.2721 763.5984 764.2328 814.1741 827.5515 837.3144 855.1506 884.8329 894.7893 910.1383 923.2797 958.3033 966.5261 977.6950 982.5243 990.1292 996.3731 996.7686 1011.0203 1025.5423 1029.6168 1035.2550 1068.9814 1085.8690 1087.9746 1098.5023 1118.2689 1146.9641 1160.2268 1170.1320 1172.1163 1183.5672 1186.7532 1200.8574 1218.0564 1266.2524 1282.9039 1289.2207 1307.6526 1318.8523 1336.9244 1348.0129 1379.9310 1383.9544 1387.3257 1425.7662 1431.6169 1442.1151 1456.7479 1462.7512 1474.2733 1477.4987 1480.5126 1482.4573 1488.4517 1511.1593 1594.6792 1597.4848 1613.1599 1617.0171 1637.9910 2943.1472 2947.8351 2983.8085 3031.2388 3041.8732 3081.4601 3101.2541 3102.2104 3105.3113 3111.3282 3125.8075 3128.0040 3138.5065 3139.5896 3150.7510 3162.4019 3164.7283 3193.1763 3523.7747 3535.0124
redmass: 4.5210 4.3929 3.9004 6.3680 4.2394 5.3325 3.5058 3.0908 4.0858 3.2489 1.3750 3.8661 3.0555 3.0399 1.4165 2.5754 4.0537 3.5808 6.0004 3.4832 2.7400 2.9372 3.4324 1.9581 2.2234 2.7077 3.4486 3.8394 2.6988 1.6051 6.2890 5.2101 5.7691 1.9969 5.8492 1.9828 3.2744 1.6999 2.5370 4.0116 4.2724 1.2767 1.2508 4.0594 2.2343 1.4310 1.4957 1.9842 1.3447 1.3948 5.9996 6.1409 1.3245 1.3000 4.2992 2.2252 2.4488 4.0492 1.8453 1.6748 1.5921 2.4602 1.2631 1.7054 1.8698 1.0516 1.0610 1.1152 1.1128 2.1391 2.1173 2.0642 1.4223 1.6995 1.3313 1.4655 1.3064 1.3967 1.2174 5.1640 5.7665 2.3074 1.2970 1.8179 1.0553 1.4508 1.1075 1.0627 1.6621 1.5271 2.1867 2.3142 6.0925 6.0553 6.1305 5.7295 4.4494 1.0723 1.0441 1.0360 1.1021 1.0853 1.0980 1.1011 1.0883 1.0997 1.0879 1.0858 1.0865 1.0912 1.0932 1.0952 1.0998 1.1012 1.0949 1.0765 1.0765
irintensity: 0.5090 0.3918 0.6136 2.7361 1.3681 7.2935 0.2674 3.6378 1.4977 3.9537 0.8404 0.1171 7.7976 0.4537 4.6918 8.7181 2.4073 3.0936 0.3246 14.2436 0.3490 0.0316 3.5939 2.4440 3.9398 35.8099 39.9713 3.9088 31.2943 173.7180 0.8481 11.3788 5.9637 55.5643 10.2325 46.1306 21.4776 92.2642 23.1491 0.7172 3.9585 0.2438 0.2070 7.2178 7.4419 13.0656 2.6108 4.4827 0.0886 0.2909 1.2844 0.7323 0.3669 3.1135 0.6895 13.6904 7.7928 175.4037 29.8365 8.9892 14.6752 1.2987 0.5217 14.2985 5.9304 0.5863 0.3626 2.8466 5.8754 30.2925 187.0003 46.2371 9.4644 43.6820 7.2204 49.5005 23.7404 10.1491 23.8945 74.0361 2.4887 32.0386 14.5232 21.1162 20.9996 454.2163 82.6099 13.0123 41.7070 92.0368 0.4878 544.7002 0.5990 41.3042 1.7669 61.3903 169.1951 28.4694 95.6981 34.7581 46.3615 7.4144 41.7636 17.2707 19.3749 27.6276 9.4809 0.1400 0.4302 15.6710 35.5187 39.1831 27.9824 18.5191 9.6376 10.7693 54.0038
temp: 298.150 k
press: 1.00000 atm
elementType: 8 8 7 7 6 6 6 6 6 6 6 6 6 6 6 6 6 6 6 6 6 1 1 1 1 1 1 1 1 1 1 1 1 1 1 1 1 1 1 1 1
symmnumber: 1
zpe: 882180.1 jmol-1
zpe.correction: 0.336005 hartree
zpe.thermalcorrener: 0.355452 hartree
zpe.thermalcorrenthalpy: 0.356396 hartree
zpe.thermalcorrgfe: 0.286419 hartree
zpe.sumelectzpe: -918.233373 hartree
zpe.sumelectthermal: -918.213926 hartree
zpe.sumelectthermalent: -918.212982 hartree
zpe.sumelectthermalfe: -918.282959 hartree
dipole: 3.7761 -0.6193 3.4057
dipole: 5.1227
quadrupole: -113.3636 -121.4767 -117.3370
quadrupole: -4.1066 -6.9630 -2.2724
quadrupole: 4.0288 -4.0843 0.0555 -4.1066 -6.9630 -2.2724
hfenergy: -918.5693781 hartree
pointgroup: C01 [X(C17H20N2O2)]
dipole: 1.5303585 -0.0173149 -1.3113399 debye
polarizability: 253.950439|11.8987872|173.1872178|18.9674951|-2.7675593|187.5388669 unknown
InChI: InChI=1S/C17H20N2O2/c1-13(16(21-2)14-9-5-3-6-10-14)18-17(20)19-15-11-7-4-8-12-15/h3-13,16,18-19H,1-2H3
charge 0 multiplicity 1
41 atoms
O  2.85222 1.335785 -1.244042
O  -1.050755 0.788061 1.671543
N  0.432682 1.192369 -0.084383
N  -1.810556 0.749204 -0.571956
C  1.584947 1.404823 0.801902
C  2.85346 0.79812 0.132038
C  2.897268 -0.727296 0.167147
C  1.782497 2.902638 1.133696
C  3.563918 -1.382004 1.23248
C  2.251181 -1.509995 -0.821768
C  -0.8280 0.901603 0.426616
C  3.573192 -2.791989 1.320037
C  2.26456 -2.920152 -0.740949
C  4.1285 1.162167 -1.941949
C  2.921568 -3.566006 0.332162
C  -3.197603 0.492936 -0.402848
C  -3.991123 0.400216 -1.580573
C  -3.813682 0.329803 0.868189
C  -5.375525 0.151054 -1.4926
C  -5.201685 0.082871 0.937204
C  -5.993782 -0.008981 -0.23053
H  1.372088 0.852753 1.734747
H  3.737725 1.197373 0.677741
H  2.596607 3.037014 1.870624
H  0.855324 3.312064 1.569188
H  2.035793 3.473236 0.222817
H  0.604706 1.365211 -1.077409
H  4.075952 -0.786348 1.999584
H  1.751068 -1.007751 -1.656726
H  4.089035 -3.284976 2.151652
H  1.760004 -3.515592 -1.510369
H  4.948936 1.673134 -1.396976
H  4.001166 1.626549 -2.932655
H  4.384582 0.091154 -2.061525
H  2.928132 -4.659828 0.39647
H  -1.500751 0.825504 -1.543036
H  -3.521845 0.525378 -2.565968
H  -3.200256 0.396067 1.76833
H  -5.969973 0.083252 -2.410812
H  -5.667053 -0.040958 1.921963
H  -7.069526 -0.201963 -0.160358
