program: Gaussian 09
title: 000026013
version: EM64L-G09RevD.01
frameworkgroup: C1[X(C24H32N2O2)]
method: RPBEPBE
basis: SDD
operation: Freq
keyword: #p
keyword: freq=noraman
keyword: PBEPBE/SDD
title: #p freq=noraman PBEPBE/SDD
converged: NO YES NO NO
title: Mulliken charges:
elementType: O O N N C C C C C C C C C C C C C C C C C C C C C C C C H H H H H H H H H H H H H H H H H H H H H H H H H H H H H H H H
charge: -0.263379 -0.250065 -0.072771 -0.124252 0.121820 -0.481665 -0.450737 -0.447243 -0.432461 -0.436903 0.423670 0.180445 -0.141339 -0.407535 -0.370285 0.463514 -0.249612 -0.261858 -0.639785 -0.633926 -0.433284 -0.397597 -0.242581 -0.224774 -0.236469 -0.236812 -0.676131 -0.247309 0.214980 0.220837 0.220488 0.220898 0.245925 0.198545 0.208623 0.207499 0.218853 0.226738 0.185660 0.254300 0.253949 0.223234 0.224871 0.217155 0.189609 0.241659 0.188976 0.255969 0.215637 0.240902 0.270539 0.227896 0.228192 0.226934 0.221970 0.221517 0.211125 0.228576 0.233210 0.224059
chargesum: 0.00000
title: Mulliken charges with hydrogens summed into heavy atoms:
elementType: O O N N C C C C C C C C C C C C C C C C C C C C C C C C
charge: -0.263379 -0.250065 -0.072771 -0.124252 0.121820 -0.045848 -0.009352 -0.002773 -0.016339 0.008688 0.423670 0.180445 0.044322 -0.153235 -0.116335 0.463514 -0.026379 -0.036987 0.008638 0.026655 -0.192382 -0.127058 -0.014686 0.230353 -0.014499 -0.015295 -0.003220 -0.023250
polarizability: 2.89752952e+02 -3.01881219e+01 2.72956758e+02 1.91123804e+01 2.07726918e+01 2.47101854e+02
1716.lowfreq: -9.3164 -4.4698 -0.0004 -0.0002 -0.0002 7.6133 14.0694 19.8045 25.6726
frequency: 13.9574 19.7440 25.6179 29.9370 46.2208 46.7773 59.5558 71.7571 77.1792 82.5300 88.3292 122.1201 127.1617 141.9363 161.3152 167.5457 198.8877 212.0199 220.2020 236.5091 251.2335 257.9621 272.4515 296.6387 301.3498 321.1649 333.1447 344.4933 349.3126 359.3331 378.1346 385.6263 404.2239 407.1992 437.4220 455.6028 480.3060 495.9124 525.9523 536.7854 555.0609 581.1086 595.5549 615.8339 616.6382 637.5762 697.7508 705.7373 707.5578 749.6443 755.2105 771.4243 774.3215 780.7849 798.3025 816.1357 818.3107 853.3355 854.8733 859.3836 892.3699 912.1914 922.4322 934.1267 939.5373 979.0216 979.1746 983.3339 990.2502 991.0455 995.4015 995.7347 1001.2402 1008.4423 1022.3585 1023.9409 1027.4105 1031.0218 1032.1627 1049.6900 1061.2277 1077.7242 1082.8840 1090.5900 1094.8112 1111.3925 1121.0441 1131.0127 1133.7246 1136.5302 1159.8040 1164.2292 1168.6424 1173.5559 1180.1652 1189.6969 1193.5699 1198.2513 1201.3990 1211.3953 1238.2282 1246.0980 1247.6944 1279.9036 1288.1192 1295.4854 1303.2777 1316.5669 1320.3273 1328.0077 1329.3902 1346.6398 1348.8094 1354.3227 1370.5951 1378.4293 1384.9613 1390.1090 1399.7405 1417.0403 1433.5804 1438.2711 1440.4883 1444.2239 1455.3120 1462.2527 1462.8062 1469.5323 1472.3908 1472.7120 1474.7609 1479.6770 1482.4692 1483.0004 1485.2985 1486.2563 1493.1095 1589.1928 1591.5165 1603.9917 1610.3244 1613.2004 2833.7040 2835.7394 2849.6097 2864.3141 2867.3376 2932.6868 2995.4503 3003.9126 3007.4241 3009.4602 3025.0473 3028.9446 3031.7983 3035.9647 3058.0198 3067.8507 3076.6878 3080.0425 3087.3299 3092.1134 3094.7609 3107.1755 3116.9876 3120.4802 3124.3935 3128.2013 3137.3662 3141.1776 3145.1763 3156.3281 3159.5661 3169.0421
redmass: 4.5480 3.2430 4.4599 4.1250 3.6778 3.4505 2.6184 3.9841 3.2785 5.2504 4.2555 3.4417 3.4275 3.2635 3.1489 3.5123 2.8368 2.1584 1.3706 2.7288 1.2931 1.8537 3.3881 3.1241 2.4751 2.9463 3.5075 2.7874 3.0575 3.0506 2.8439 2.2538 2.8396 2.8392 3.2097 2.9173 2.5328 3.2664 4.0972 4.1533 2.7105 2.4027 4.2294 6.3681 6.2583 4.3421 6.1152 1.7462 1.7090 3.1417 2.8179 2.5443 2.3765 3.6453 1.1057 1.7051 2.6654 2.1674 1.2606 1.6858 3.6744 1.9409 1.4605 2.3707 1.9907 1.4036 1.4080 2.6024 4.8293 4.3048 1.3883 1.3950 2.2143 2.3594 2.2453 1.8000 2.0126 1.9830 1.7255 2.7449 2.4054 1.5792 1.7322 1.3269 3.2075 2.2902 2.7412 2.2377 1.4723 1.6368 2.1789 2.5085 1.0643 1.0567 1.1290 1.2453 2.7305 2.2589 1.4085 2.1881 1.5361 2.2897 1.1363 1.4528 1.3500 1.7496 1.3955 1.3186 1.3529 1.3198 1.3479 1.4193 1.4032 1.3895 1.5214 5.7405 2.7912 1.7154 1.2643 1.1450 2.1244 1.7745 1.1233 1.3124 1.0991 1.0628 1.0403 1.0814 1.0653 1.0642 1.0768 2.0262 1.1333 1.9311 1.0662 1.1065 1.0605 5.9637 6.1410 7.9088 6.1264 7.3957 1.0716 1.0796 1.0577 1.0696 1.0577 1.0651 1.0358 1.0616 1.0647 1.0581 1.0862 1.0742 1.0752 1.0911 1.0881 1.1066 1.1010 1.1016 1.0995 1.0985 1.0991 1.1025 1.0841 1.0846 1.0875 1.0881 1.0919 1.0936 1.0962 1.0968 1.1014 1.0973
irintensity: 0.2504 0.3651 0.2566 0.1623 0.6946 0.1213 0.6287 0.8793 0.3800 0.3349 0.3406 0.5698 0.1952 2.6481 2.5947 1.2511 1.4065 0.7015 0.5328 2.3504 0.7799 2.1792 1.4328 1.8095 2.2248 4.6758 2.4078 2.4958 13.8056 0.4533 0.7245 2.8350 0.0999 0.1741 1.1371 0.5372 7.8213 1.5222 6.0546 11.2251 21.7287 2.3424 1.9203 0.1134 0.2171 6.8509 2.3662 68.8909 43.3397 7.6073 28.7605 20.3208 16.8582 12.4822 3.4230 1.9560 6.7144 7.1454 0.5167 5.1401 15.1920 2.4442 9.0927 5.5986 0.4291 0.5426 0.1659 6.4421 0.9607 3.1108 3.9037 1.6368 47.6182 53.7821 37.0722 36.8392 7.3205 6.1720 5.8340 30.1512 29.6370 1.4647 22.0608 7.3354 157.4960 7.3360 121.7013 40.1642 7.4008 18.8009 4.1887 72.2052 0.2645 0.1990 0.6667 7.6964 7.1086 5.2737 3.2143 2.9164 3.5737 7.0071 0.0486 13.3927 29.5060 2.2914 6.4435 13.0166 0.2741 4.1946 11.5791 4.1784 12.0787 2.4588 9.1203 0.1125 2.7248 11.3885 24.5019 1.6052 11.8864 7.7419 4.7800 17.9669 20.9192 15.2781 10.7305 10.7957 0.8844 3.8903 5.0455 8.2900 16.9348 19.9924 13.2107 23.2687 10.8853 3.4346 0.9223 86.4601 5.2495 50.6536 85.4151 41.3030 77.3192 102.7493 175.0421 57.2900 20.2571 8.1898 26.2308 19.0581 17.8794 27.0020 62.6192 63.3944 17.1247 7.7693 14.7760 24.4572 34.9217 30.5138 32.0300 40.4536 1.1702 1.5735 3.7584 4.1988 16.6995 22.8767 35.6905 38.9180 24.0069 11.6683
temp: 298.150 k
press: 1.00000 atm
elementType: 8 8 7 7 6 6 6 6 6 6 6 6 6 6 6 6 6 6 6 6 6 6 6 6 6 6 6 6 1 1 1 1 1 1 1 1 1 1 1 1 1 1 1 1 1 1 1 1 1 1 1 1 1 1 1 1 1 1 1 1
symmnumber: 1
zpe: 1338578.4 jmol-1
zpe.correction: 0.509838 hartree
zpe.thermalcorrener: 0.537722 hartree
zpe.thermalcorrenthalpy: 0.538666 hartree
zpe.thermalcorrgfe: 0.448676 hartree
zpe.sumelectzpe: -1191.569278 hartree
zpe.sumelectthermal: -1191.541393 hartree
zpe.sumelectthermalent: -1191.540449 hartree
zpe.sumelectthermalfe: -1191.630440 hartree
dipole: -0.0937 -0.1021 0.9391
dipole: 0.9492
quadrupole: -162.1905 -162.0377 -159.2078
quadrupole: -6.8412 -7.0715 -2.1634
quadrupole: -1.0451 -0.8924 1.9375 -6.8412 -7.0715 -2.1634
hfenergy: -1192.0791155 hartree
pointgroup: C01 [X(C24H32N2O2)]
dipole: 0.0601076 0.0718338 0.3615265 debye
polarizability: 280.4698794|-34.3342819|276.3393986|-19.7589683|-19.5220324|253.002286 unknown
InChI: InChI=1S/C24H32N2O2/c1-4-28-23(27)24(21-13-9-6-10-14-21)15-17-26(18-16-24)19-22(25(2)3)20-11-7-5-8-12-20/h5-14,22H,4,15-19H2,1-3H3
charge 0 multiplicity 1
60 atoms
O  3.016429 1.378667 1.205071
O  3.156343 2.211277 -0.956314
N  -0.898278 0.930728 -0.706842
N  -4.662045 1.705211 -0.65858
C  1.950443 0.063243 -0.551877
C  0.887239 -0.293647 0.523393
C  1.205364 0.320534 -1.899331
C  -0.227351 0.765095 0.60383
C  0.063103 1.346165 -1.756243
C  -2.135069 1.743283 -0.655266
C  3.020819 -1.044532 -0.744085
C  2.74144 1.334751 -0.159813
C  -3.428427 0.862958 -0.719452
C  3.011829 -2.246421 0.006688
C  4.04732 -0.860422 -1.710118
C  -3.428572 -0.165753 0.413058
C  3.991452 -3.2428 -0.210471
C  5.027365 -1.851911 -1.925478
C  -4.666972 2.861825 -1.580963
C  -5.885948 0.890563 -0.846649
C  -2.966935 -1.48473 0.186757
C  -3.834459 0.203219 1.72151
C  5.002404 -3.052544 -1.178119
C  3.88092 2.50895 1.666901
C  -2.906213 -2.419846 1.24634
C  -3.778131 -0.728459 2.781335
C  4.053456 2.341404 3.172839
C  -3.310626 -2.04461 2.548513
H  0.417929 -1.255918 0.244899
H  1.359495 -0.404781 1.51452
H  1.915388 0.677753 -2.664807
H  0.785949 -0.645484 -2.237217
H  -0.976925 0.444044 1.346318
H  0.202124 1.736509 0.965906
H  0.501299 2.35491 -1.546752
H  -0.475619 1.416954 -2.719488
H  -2.182722 2.371509 0.262082
H  -2.133754 2.432126 -1.51952
H  -3.374396 0.308433 -1.693402
H  2.244845 -2.414922 0.767871
H  4.089472 0.071402 -2.286455
H  3.964172 -4.166238 0.379489
H  5.810902 -1.687139 -2.673903
H  -5.643095 3.372421 -1.499691
H  -4.520578 2.576636 -2.654404
H  -3.889772 3.593303 -1.305768
H  -5.9485 0.428869 -1.864597
H  -5.918819 0.078557 -0.102488
H  -6.777485 1.526805 -0.702126
H  -2.644445 -1.772237 -0.820362
H  -4.211584 1.219566 1.883027
H  5.761638 -3.824837 -1.345361
H  4.839485 2.454259 1.119715
H  3.384688 3.458747 1.396916
H  -2.548179 -3.438379 1.055834
H  -4.099327 -0.432305 3.786931
H  4.69235 3.151786 3.569079
H  3.079045 2.383102 3.689095
H  4.531159 1.375142 3.408301
H  -3.26794 -2.768992 3.370126
