program: Gaussian 09
title: 000275911
version: EM64L-G09RevD.01
frameworkgroup: C1[X(C8H12FNO2)]
method: RPBEPBE
basis: SDD
operation: Freq
keyword: #p
keyword: freq=noraman
keyword: PBEPBE/SDD
title: #p freq=noraman PBEPBE/SDD
converged: YES YES NO NO
title: Mulliken charges:
elementType: F O O N C C C C C C C C H H H H H H H H H H H H
charge: -0.244064 -0.302239 -0.291571 -0.377160 -0.140803 -0.028992 -0.441953 -0.460888 -0.187086 -0.191989 0.272076 -0.495798 0.278071 0.223205 0.229381 0.232462 0.220797 0.241982 0.212249 0.209872 0.334089 0.238927 0.239452 0.229977
chargesum: 0.00000
title: Mulliken charges with hydrogens summed into heavy atoms:
elementType: F O O N C C C C C C C C
charge: -0.244064 -0.302239 -0.291571 -0.043071 0.137268 0.194213 0.019891 0.001891 0.025163 0.017883 0.272076 0.212559
polarizability: 1.25409776e+02 1.04360165e+00 8.31180057e+01 5.87400117e+00 3.56766290e+00 8.09202426e+01
1716.lowfreq: -0.0012 -0.0010 -0.0009 3.2643 11.6226 15.8687 33.5005 67.8728 73.2058
frequency: 33.2691 67.8631 73.2022 87.5855 118.7210 149.4967 167.3323 225.3201 252.3747 319.3898 350.7311 377.1341 385.3855 533.8428 542.8706 597.1799 622.1174 655.0478 672.4437 699.7091 761.3863 810.9898 868.2045 891.0784 921.2675 940.7789 969.8114 975.0662 1009.2758 1033.3902 1066.3569 1109.3888 1120.6494 1138.6796 1149.3619 1168.3638 1193.0741 1205.5781 1221.1727 1278.3186 1298.0322 1300.8115 1337.0800 1347.7019 1362.2335 1381.5054 1425.7455 1441.9715 1452.9521 1455.9603 1468.8465 1490.5647 1662.1966 1681.3398 2968.3953 2977.7019 3000.4025 3022.3965 3027.7576 3042.8034 3048.1110 3099.9984 3107.9513 3138.8872 3141.9592 3559.4900
redmass: 4.1773 5.0136 4.4322 1.2074 3.6727 2.8721 3.1953 5.7615 5.3231 4.3524 3.6471 3.0886 2.2925 4.2361 4.0356 5.0786 1.1816 2.0271 1.9523 11.9110 3.6350 2.7605 4.4631 3.0956 3.2973 2.2341 2.2278 1.2534 6.2071 2.7405 1.5353 1.7925 1.2542 4.7276 1.4399 1.2261 1.2790 1.2960 1.5382 1.3377 1.4278 1.3152 1.4471 1.7023 1.7045 1.5794 1.1621 1.0871 1.0497 1.0891 1.0770 1.8594 9.3829 6.6074 1.0642 1.0635 1.0298 1.0941 1.0859 1.0921 1.0916 1.1047 1.0844 1.0998 1.1042 1.0772
irintensity: 1.4642 5.3124 3.2994 2.0227 1.6431 5.8328 4.2683 6.9955 6.6890 23.1151 1.7645 0.5540 0.3254 1.9635 10.3059 2.2187 115.8054 33.7067 23.8683 22.3048 19.8328 34.4303 29.9958 2.6589 1.2025 16.2041 4.4588 2.5029 92.1037 32.2096 4.1089 1.6501 0.1397 37.8189 67.0362 30.9527 44.3198 67.2516 44.4271 59.8248 33.8121 10.0086 27.6076 12.6986 7.6355 2.5268 3.0310 12.5216 12.8660 12.8001 66.1004 334.5004 289.6708 7.9834 20.7903 22.2233 46.5275 18.3519 8.8135 27.3721 27.2779 31.7454 5.5624 50.8192 18.4930 46.5467
temp: 298.150 k
press: 1.00000 atm
elementType: 9 8 8 7 6 6 6 6 6 6 6 6 1 1 1 1 1 1 1 1 1 1 1 1
symmnumber: 1
zpe: 508448.8 jmol-1
zpe.correction: 0.193658 hartree
zpe.thermalcorrener: 0.205978 hartree
zpe.thermalcorrenthalpy: 0.206922 hartree
zpe.thermalcorrgfe: 0.153899 hartree
zpe.sumelectzpe: -616.158532 hartree
zpe.sumelectthermal: -616.146212 hartree
zpe.sumelectthermalent: -616.145268 hartree
zpe.sumelectthermalfe: -616.198291 hartree
dipole: 0.4972 0.1915 0.1831
dipole: 0.5634
quadrupole: -59.3857 -74.3442 -71.0358
quadrupole: -4.5336 6.2872 6.8371
quadrupole: 8.8695 -6.0889 -2.7806 -4.5336 6.2872 6.8371
hfenergy: -616.3521898 hartree
pointgroup: C01 [X(C8H12F1N1O2)]
dipole: 0.1968947 0.0734732 0.0704745 debye
dipolederiv: -0.3831719 -0.0461854 0.0140836 -0.0464331 -0.5116665 0.1763869 -0.0070501 0.2478679 -0.5142696 -1.6547454 0.1410888 -0.0994138 0.3970158 -0.4642621 0.1286961 -0.3554789 0.1394991 -0.4457493 -0.7658901 -0.0395998 0.0497094 -0.1063858 -0.6782328 0.3382402 0.120484 0.3337426 -0.6748219 -1.5241127 -0.1311339 0.1793671 -0.2474776 -0.481502 -0.0302301 0.2635919 -0.054346 -0.4331495 0.6666229 -0.1160633 -0.0161068 -0.3320707 0.1187374 0.0956166 0.1209523 0.066014 0.1155109 0.3910681 0.0346021 -0.027706 0.0746231 0.5340881 -0.1937316 -0.0199182 -0.2218834 0.5664024 -0.1540489 0.0552176 -0.0230632 0.1134969 0.091842 -0.0690494 -0.1025229 -0.1181331 0.0604281 -0.1352775 0.0734849 -0.0949026 -0.005996 0.02673 -0.0388664 -0.0136972 -0.0514928 0.0552821 0.1852851 -0.0919753 0.1030347 -0.1040722 -0.0676782 0.0565882 0.1672615 0.1107386 -0.0925408 -0.0016635 -0.1132004 0.0123425 -0.0865821 0.055074 0.1744842 0.0059779 0.1750922 -0.1136658 2.4105153 0.0530849 -0.1141783 0.032062 0.8592458 -0.5777464 -0.0913918 -0.5701863 0.8516698 0.7888517 0.0047954 -0.0196185 0.1127051 0.2565612 0.0272648 -0.1229946 0.0315189 0.2612455 0.1156243 -0.0156715 0.0258697 0.0483233 0.0517584 0.0387496 -0.0263102 0.02055 -0.0141432 0.0214839 0.0737067 0.0728308 0.0745251 -0.076748 -0.078818 0.0622782 -0.0344941 -0.0603118 0.032394 0.0081407 -0.0469133 0.0513147 0.0561513 0.1259376 -0.0265464 0.0465317 -0.0713987 -0.0133154 -0.0918609 -0.0342319 -0.0871207 -0.0665504 -0.0411933 0.0093308 -0.0212588 0.0865276 0.1029541 0.0562381 0.0578594 0.0231539 0.0516091 0.0216405 -0.0029559 -0.0089729 -0.1429117 -0.0413459 -0.0757644 0.0067976 -0.092745 -0.0690275 -0.0395556 0.0131641 0.0098098 0.1098403 -0.0296361 0.0896542 0.0195883 0.1205517 -0.0352187 -0.1147825 0.0219595 -0.1135033 0.0804592 -0.1378314 0.088619 -0.048701 0.0817788 0.0575407 -0.0396649 -0.0565003 -0.0374855 0.1122195 0.1803968 -0.0113215 0.0334309 0.0384392 0.2743924 0.0663826 -0.0205155 0.0799291 0.2491508 -0.0044504 -0.0084533 -0.0037869 -0.0450385 0.0836059 -0.0444178 0.1116514 -0.0572614 -0.1149298 -0.0032352 0.0016771 0.0097213 -0.1146114 -0.1097641 -0.056843 0.044691 -0.047963 0.0809038 -0.0464719 0.0609202 -0.0560128 0.1005433 0.0433141 0.0749117 -0.0954606 0.0756867 0.0482521 unknown
polarizability: 125.5293741|0.7080768|83.0789089|5.4935958|3.5205357|80.8397418 unknown
InChI: InChI=1S/C8H12FNO2/c1-12-8(11)10-7-5-3-2-4-6(7)9/h2-3,6-7,10H,4-5H2,1H3
charge 0 multiplicity 1
24 atoms
F  1.518898 1.831831 -0.74719
O  -3.157164 0.536986 -0.430376
O  -2.199619 -1.015374 1.067465
N  -0.893959 0.374193 -0.31023
C  0.411963 -0.14359 0.113711
C  1.346387 1.017041 0.486328
C  1.059496 -1.048904 -0.966113
C  2.725357 0.559926 0.97047
C  2.498388 -1.39116 -0.627865
C  3.245736 -0.666665 0.244038
C  -2.075764 -0.120011 0.189938
C  -4.48929 0.098424 0.031887
H  0.236145 -0.742347 1.027228
H  0.860414 1.699632 1.207095
H  1.019911 -0.530252 -1.945981
H  0.452927 -1.967504 -1.070394
H  2.668379 0.358465 2.060824
H  3.429639 1.407239 0.857286
H  2.941038 -2.259019 -1.133842
H  4.284063 -0.957558 0.449704
H  -0.924855 1.099646 -1.028966
H  -4.60557 0.284992 1.113081
H  -4.632897 -0.977599 -0.165055
H  -5.199623 0.703107 -0.549946
