program: Gaussian 09
title: 000275898
version: EM64L-G09RevD.01
frameworkgroup: C1[X(C16H12O)]
method: RPBEPBE
basis: SDD
operation: Freq
keyword: #pfreq=noraman
keyword: PBEPBE/SDD
title: #p freq=noraman PBEPBE/SDD
converged: NO YES NO YES
title: Mulliken charges:
elementType: O C C C C C C C C C C C C C C C C H H H H H H H H H H H H
charge: -0.204455 -0.513093 -0.450332 -0.512420 0.369905 0.347207 0.443397 0.051656 0.137350 -0.453732 -0.447771 -0.436972 -0.370755 -0.225611 -0.225344 -0.223565 -0.243823 0.264202 0.285659 0.240139 0.239333 0.240495 0.252652 0.236975 0.280404 0.225835 0.226653 0.230535 0.235476
chargesum: 0.00000
title: Mulliken charges with hydrogens summed into heavy atoms:
elementType: O C C C C C C C C C C C C C C C C
charge: -0.204455 -0.248892 -0.164673 -0.032948 0.369905 0.347207 0.443397 0.051656 0.137350 -0.213237 -0.195119 -0.199997 -0.090351 0.000224 0.001310 0.006970 -0.008347
polarizability: 1.94582465e+02 -8.16281771e+00 1.74334923e+02 1.63713165e+00 -8.07658719e+00 1.19347501e+02
1716.lowfreq: -8.2000 -0.0009 -0.0007 -0.0003 9.2553 10.7020 57.9352 84.4113 125.3130
frequency: 57.8821 84.3972 125.3120 142.0006 197.9550 274.5365 311.2591 345.3274 365.2776 378.5184 423.2299 432.0746 489.8828 500.6015 508.7253 556.3992 577.6524 599.9523 623.0557 681.7146 694.4628 723.9448 755.5970 765.9974 779.8305 791.2450 815.0151 857.4601 861.2065 885.9178 900.5075 919.9504 948.2587 972.3480 973.9783 987.9497 999.7198 1004.5450 1017.8032 1027.0255 1043.2962 1071.4607 1112.0309 1132.5035 1152.5405 1159.6673 1169.8849 1173.9703 1193.4072 1200.8408 1220.9738 1242.2968 1254.9170 1273.5470 1290.8511 1307.7527 1325.6515 1383.7385 1395.5823 1442.5835 1445.6786 1461.5495 1465.8156 1485.6291 1573.2085 1591.0592 1600.5671 1613.1321 1620.2100 3017.7955 3050.9692 3076.3535 3084.8025 3121.3374 3123.4423 3132.6516 3136.7684 3145.0640 3149.2946 3162.4260 3165.5138
redmass: 5.2420 6.2949 4.6638 3.9493 4.5808 5.9782 4.5189 4.3402 2.8641 4.7568 3.3721 3.7947 4.6590 6.1973 4.6658 4.1266 4.1998 3.8144 5.5892 4.9235 4.2498 4.6759 2.0054 1.6371 1.8129 3.2280 3.4040 3.0858 3.3528 1.5447 1.6481 2.8157 1.4944 2.1360 1.4558 1.3255 2.1799 1.3813 2.2984 2.2632 2.2439 2.8576 1.7044 1.4233 1.4178 1.9210 1.0989 1.0746 2.0539 1.6093 2.1980 1.8538 1.8391 1.6846 1.4652 1.5677 1.4550 7.3283 6.6559 2.4182 2.3630 2.4751 2.3415 1.1661 7.2792 7.5095 6.8404 7.1526 8.0795 1.0606 1.0872 1.0885 1.1058 1.0870 1.0858 1.0895 1.0891 1.0947 1.0936 1.1003 1.1002
irintensity: 1.4040 1.5654 1.0057 0.0449 1.6958 3.5259 5.9180 0.1566 0.1767 1.4256 0.8851 7.1149 1.9275 3.3242 1.3799 25.7296 1.9046 12.5934 3.9659 3.8982 3.8250 1.2227 27.9146 50.4467 50.2298 13.2002 1.3927 0.4341 5.3444 0.6603 0.1850 3.9113 2.4270 41.1995 6.5776 0.2281 3.0381 0.7649 5.5250 0.5275 1.0337 1.8436 14.7281 15.1437 1.0779 1.1108 0.1410 0.8162 2.2536 0.9597 36.1331 4.7812 37.5921 32.1689 7.7308 8.7898 4.3685 5.2137 0.6831 20.2353 8.2024 23.3488 3.1655 19.1561 43.7311 129.2542 1.6128 2.4838 69.3741 31.8088 30.2678 16.6187 31.9742 3.8834 1.4078 4.9124 10.5065 23.9608 11.7406 33.2407 29.1643
temp: 298.150 k
press: 1.00000 atm
elementType: 8 6 6 6 6 6 6 6 6 6 6 6 6 6 6 6 6 1 1 1 1 1 1 1 1 1 1 1 1
symmnumber: 1
zpe: 604887.4 jmol-1
zpe.correction: 0.230389 hartree
zpe.thermalcorrener: 0.242238 hartree
zpe.thermalcorrenthalpy: 0.243182 hartree
zpe.thermalcorrgfe: 0.192389 hartree
zpe.sumelectzpe: -690.983411 hartree
zpe.sumelectthermal: -690.971562 hartree
zpe.sumelectthermalent: -690.970618 hartree
zpe.sumelectthermalfe: -691.021412 hartree
dipole: -0.0887 -3.3640 1.3499
dipole: 3.6258
quadrupole: -89.1771 -99.4168 -95.5667
quadrupole: -5.4028 0.6250 1.8085
quadrupole: 5.5431 -4.6966 -0.8465 -5.4028 0.6250 1.8085
hfenergy: -691.2138004 hartree
pointgroup: C01 [X(C16H12O1)]
dipole: -0.0439299 -1.3245345 0.527826 debye
polarizability: 194.4852131|-8.2264603|174.4523429|1.9418949|-7.9966067|119.3273329 unknown
InChI: InChI=1S/C16H12O/c17-16-13-8-4-3-7-12(13)14-9-15(16)11-6-2-1-5-10(11)14/h1-8,14-15H,9H2
charge 0 multiplicity 1
29 atoms
O  0.774267 2.848696 -0.574147
C  -0.088723 -0.730847 1.420386
C  -0.686087 1.53911 0.90537
C  -0.269695 0.6531 2.122328
C  -1.322079 -0.74332 0.49807
C  -1.659878 0.598886 0.182299
C  1.178157 -0.656743 0.564082
C  0.554128 1.749622 0.009093
C  1.468092 0.562939 -0.126584
C  -2.04169 -1.815376 -0.051852
C  -2.717344 0.890043 -0.695137
C  2.06077 -1.748992 0.422082
C  2.622051 0.660794 -0.943043
C  -3.125294 -1.52781 -0.924511
C  -3.457794 -0.190436 -1.243647
C  3.211058 -1.644806 -0.394517
C  3.493009 -0.43834 -1.080569
H  -0.04615 -1.586896 2.114434
H  -1.110549 2.522824 1.160793
H  -1.093261 0.615154 2.858119
H  0.649928 1.002953 2.623719
H  -1.781638 -2.853944 0.183031
H  -2.971378 1.924635 -0.950676
H  1.850474 -2.685223 0.952888
H  2.811632 1.609003 -1.457474
H  -3.708194 -2.349244 -1.356227
H  -4.295004 0.013713 -1.920505
H  3.887267 -2.501497 -0.494132
H  4.383728 -0.3613 -1.713171
