program: Gaussian 09
title: 000275896
version: EM64L-G09RevD.01
frameworkgroup: C1[X(C16H12)]
method: RPBEPBE
basis: SDD
operation: Freq
keyword: #p
keyword: freq=noraman
keyword: PBEPBE/SDD
title: #p freq=noraman PBEPBE/SDD
converged: NO NO NO YES
title: Mulliken charges:
elementType: C C C C C C C C C C C C C C C C H H H H H H H H H H H H
charge: 0.090155 0.090154 -0.661669 -0.661669 0.189834 0.189834 0.284938 0.284939 -0.423711 -0.423710 -0.429165 -0.429166 -0.234193 -0.234194 -0.241220 -0.241221 0.247284 0.247282 0.247284 0.247282 0.240861 0.240861 0.241677 0.241677 0.223882 0.223882 0.224044 0.224044
chargesum: 0.00000
title: Mulliken charges with hydrogens summed into heavy atoms:
elementType: C C C C C C C C C C C C C C C C
charge: 0.090155 0.090154 -0.167102 -0.167102 0.189834 0.189834 0.284938 0.284939 -0.182849 -0.182849 -0.187489 -0.187489 -0.010311 -0.010311 -0.017177 -0.017177
polarizability: 3.10506085e+02 9.36080187e+00 1.70600562e+02 3.83209868e-03 -7.15669488e-04 7.21384544e+01
1716.lowfreq: -0.0010 -0.0003 0.0001 5.5253 5.8246 18.1892 63.7605 115.9228 147.0564
frequency: 63.7605 115.9228 147.0564 170.5713 222.2994 253.7646 295.8391 313.9590 385.6145 417.6417 424.5082 449.7491 531.3724 538.7408 545.7774 576.4498 595.6040 617.1197 667.4646 717.3788 723.8849 743.0414 763.6508 764.8252 765.5484 813.5142 860.5498 868.7739 886.4496 913.4689 928.9622 952.1771 958.0817 982.2485 982.4612 1010.0813 1019.6057 1024.1589 1067.7945 1102.7338 1114.4155 1114.6590 1115.8232 1161.3871 1162.7965 1173.8551 1183.8849 1191.0639 1204.3338 1277.3881 1284.7054 1334.1949 1376.0517 1399.2272 1402.2487 1418.6390 1425.5402 1441.7924 1452.5657 1466.5621 1477.0467 1553.7804 1588.4549 1590.2220 1614.9038 1623.4402 2981.2583 2981.5973 3024.2681 3024.7743 3119.1986 3119.2797 3126.7049 3126.7348 3140.4085 3140.4594 3159.2398 3159.5401
redmass: 4.9806 3.7185 4.6073 3.5792 3.0177 1.8318 5.5448 4.7027 5.1408 2.8877 2.8005 2.2990 3.9042 3.2950 5.6586 6.0756 3.2549 6.7708 6.1811 2.2134 1.9730 4.4919 1.7147 1.5228 4.9134 4.6143 1.3216 1.3275 6.1559 1.8049 1.7699 1.6912 1.7585 1.3191 1.3278 3.9324 2.1236 2.3003 4.0455 1.7700 1.1093 2.1428 1.1832 1.5495 1.3245 1.1972 1.8702 1.4897 1.7850 1.7663 1.4602 3.3465 6.5127 2.6531 2.2162 1.2537 1.2319 2.3802 2.5783 4.4500 5.2957 6.1695 7.0390 6.4248 7.3887 7.5876 1.0609 1.0610 1.0986 1.0986 1.0855 1.0855 1.0894 1.0894 1.0944 1.0944 1.1002 1.1002
irintensity: 0.4051 0.0814 0.7152 0.0000 0.0000 19.0858 0.0000 1.4961 0.0000 0.0000 14.3958 0.0000 10.5122 0.5756 0.0000 0.8399 0.0000 8.5646 0.0000 34.6658 0.0000 0.0000 0.0000 151.4442 0.3520 0.0000 2.3751 0.0000 1.8748 0.0000 0.1515 9.6726 0.0000 0.0000 0.0865 0.0000 19.3695 0.0000 4.7930 0.0000 1.2055 9.7391 0.0000 2.1716 0.0000 0.8705 0.0000 0.0000 24.4600 2.1219 0.0000 10.8629 0.0000 0.0000 30.0891 0.0000 35.5975 0.0000 9.3122 0.0000 16.1535 0.0000 0.0000 4.3954 0.0000 39.8373 0.0000 22.3835 14.1843 0.0000 9.8329 0.0013 8.2434 0.0088 0.0070 65.3799 85.4786 0.0004
temp: 298.150 k
press: 1.00000 atm
elementType: 6 6 6 6 6 6 6 6 6 6 6 6 6 6 6 6 1 1 1 1 1 1 1 1 1 1 1 1
symmnumber: 1
zpe: 588772.4 jmol-1
zpe.correction: 0.224252 hartree
zpe.thermalcorrener: 0.235600 hartree
zpe.thermalcorrenthalpy: 0.236544 hartree
zpe.thermalcorrgfe: 0.187103 hartree
zpe.sumelectzpe: -615.836292 hartree
zpe.sumelectthermal: -615.824944 hartree
zpe.sumelectthermalent: -615.823999 hartree
zpe.sumelectthermalfe: -615.873440 hartree
dipole: 0.0000 0.0000 0.0000
dipole: 0.0000
quadrupole: -85.4770 -79.0190 -98.9843
quadrupole: -1.2860 0.0002 -0.0002
quadrupole: 2.3498 8.8078 -11.1576 -1.2860 0.0002 -0.0002
hfenergy: -616.0605433 hartree
pointgroup: C01 [X(C16H12)]
dipole: -0.0000012 0.0000006 -0.0000132 debye
polarizability: 310.4803284|-9.5513053|170.6263189|0.0038331|0.0007104|72.1384544 unknown
InChI: InChI=1S/C16H12/c1-3-7-13-11(5-1)9-15-14-8-4-2-6-12(14)10-16(13)15/h1-8H,9-10H2
charge 0 multiplicity 1
28 atoms
C  0.289656 -0.628779 0.000065
C  -0.289642 0.628772 0.000067
C  -0.764094 -1.715603 0.000051
C  0.764109 1.715596 0.000103
C  1.746387 -0.510788 0.000116
C  -1.746373 0.51078 0.000069
C  -2.059483 -0.895911 0.000068
C  2.059497 0.895904 0.000151
C  2.781748 -1.472374 0.000139
C  -2.781734 1.472367 0.000075
C  -3.393638 -1.326549 0.000076
C  3.393652 1.326542 0.000211
C  4.126695 -1.027065 0.000204
C  -4.126681 1.027059 0.000087
C  -4.432494 -0.355212 0.000088
C  4.432509 0.355204 0.00024
H  -0.695249 -2.375376 0.887872
H  -0.695268 -2.375302 -0.887831
H  0.695234 2.375361 0.887928
H  0.695311 2.375303 -0.887775
H  2.554843 -2.544571 0.000102
H  -2.554828 2.544564 0.00007
H  -3.641239 -2.394711 0.000076
H  3.641254 2.394703 0.000236
H  4.940239 -1.761484 0.000226
H  -4.940226 1.761476 0.000094
H  -5.47914 -0.680096 0.000099
H  5.479154 0.680091 0.000294
