program: Gaussian 09
title: 000270349
version: EM64L-G09RevD.01
frameworkgroup: C1[X(C6H16NO4P)]
method: RPBEPBE
basis: SDD
operation: Freq
keyword: #p
keyword: freq=noraman
keyword: PBEPBE/SDD
title: #p freq=noraman PBEPBE/SDD
converged: YES YES NO NO
title: Mulliken charges:
elementType: P O O O O N C C C C C C H H H H H H H H H H H H H H H H
charge: 1.357559 -0.499381 -0.532770 -0.625594 -0.406753 -0.552666 0.020147 0.032816 -0.670416 -0.661122 -0.659567 -0.670140 0.221938 0.224978 0.201873 0.241048 0.227204 0.206779 0.248987 0.228561 0.205211 0.257556 0.224261 0.206304 0.226861 0.229546 0.333600 0.383180
chargesum: 0.00000
title: Mulliken charges with hydrogens summed into heavy atoms:
elementType: P O O O O N C C C C C C
charge: 1.357559 -0.499381 -0.532770 -0.625594 -0.023573 -0.219066 0.242084 0.257794 -0.000291 0.023205 0.027461 -0.007429
polarizability: 1.35400348e+02 2.04278886e-01 1.07007880e+02 7.87629954e-01 5.16089632e+00 1.00274567e+02
1716.lowfreq: -15.8443 -9.2930 -0.0004 0.0016 0.0022 3.7576 14.1108 26.2095 43.8589
frequency: 11.8368 25.2235 43.8119 62.6513 66.1787 103.0690 143.2091 174.6476 191.7504 201.8461 219.5322 229.8467 241.9625 250.5599 273.1864 289.2259 324.5505 357.6581 371.4939 394.6959 406.3047 434.2083 456.5581 469.9725 504.5017 640.0806 673.3303 812.5035 828.3920 853.6381 903.1698 910.8938 923.9617 926.9860 928.0310 938.7188 939.1855 1027.9377 1092.6589 1102.6162 1152.5012 1154.0638 1181.0436 1181.2499 1258.1070 1314.4223 1326.5979 1329.4281 1336.1420 1379.1674 1381.6024 1393.9316 1397.1222 1399.2832 1452.2522 1454.2755 1463.6304 1465.8531 1468.0997 1472.0570 1486.1635 1488.3088 2983.6749 2986.4586 2991.8368 2992.6777 2994.2859 2998.7234 3080.9108 3083.3931 3090.4636 3093.4562 3096.0067 3099.7557 3104.9745 3109.1243 3449.5162 3528.2557
redmass: 3.3539 2.8529 3.1444 4.6317 4.8584 4.4683 5.2369 3.6892 1.0412 1.0304 4.0797 1.7351 1.2476 1.6997 3.5108 3.2490 2.0425 3.5398 3.1904 2.5026 2.0313 2.9914 2.2269 3.6830 4.5376 3.8234 4.5087 2.7669 4.3259 3.6113 3.0255 4.1456 3.4278 1.4052 1.1756 1.3543 1.4148 15.1482 1.6172 1.6904 2.0478 2.0361 1.9635 1.9390 1.1493 1.2484 1.2160 1.4794 1.3923 1.2633 1.2538 1.2235 1.1752 1.1234 1.0483 1.0504 1.0478 1.0467 1.0502 1.0504 1.0504 1.0470 1.0370 1.0357 1.0773 1.0365 1.0426 1.0855 1.0995 1.0987 1.1002 1.0991 1.0994 1.1013 1.1008 1.1007 1.0767 1.0683
irintensity: 2.1822 0.7380 0.0493 2.5801 1.2087 1.3924 6.1010 7.2620 0.3713 0.1998 3.8456 0.9345 3.5364 3.0466 13.8296 10.6542 16.3725 21.8357 10.1410 18.2673 44.4952 18.5808 81.4289 70.3442 68.4756 69.4322 37.8561 43.3413 180.9241 277.1255 186.4596 39.1302 9.9944 3.6462 2.2189 0.0474 0.5447 85.9626 142.3316 5.7000 3.7249 21.6152 15.7094 17.4506 65.6196 24.4847 21.3222 5.5185 6.7565 31.4082 31.8957 28.5261 18.0375 13.6397 6.4199 7.2135 5.0001 0.9549 12.0683 2.4875 16.7658 16.0347 14.6089 16.5771 16.0435 22.4717 20.8457 15.8214 18.8292 10.5385 13.0861 43.8292 41.4860 12.6046 35.7672 26.5347 12.4576 22.5524
temp: 298.150 k
press: 1.00000 atm
elementType: 15 8 8 8 8 7 6 6 6 6 6 6 1 1 1 1 1 1 1 1 1 1 1 1 1 1 1 1
symmnumber: 1
zpe: 594361.0 jmol-1
zpe.correction: 0.226380 hartree
zpe.thermalcorrener: 0.243329 hartree
zpe.thermalcorrenthalpy: 0.244273 hartree
zpe.thermalcorrgfe: 0.179894 hartree
zpe.sumelectzpe: -934.034315 hartree
zpe.sumelectthermal: -934.017366 hartree
zpe.sumelectthermalent: -934.016422 hartree
zpe.sumelectthermalfe: -934.080802 hartree
dipole: 0.2542 1.7970 0.7760
dipole: 1.9739
quadrupole: -66.3004 -78.4876 -86.3415
quadrupole: -1.4328 -2.5200 -2.9608
quadrupole: 10.7428 -1.4445 -9.2983 -1.4328 -2.5200 -2.9608
hfenergy: -934.2606956 hartree
pointgroup: C01 [X(C6H16N1O4P1)]
dipole: -0.0856514 0.7616469 -0.125018 debye
polarizability: 135.3763603|-1.0790319|109.0530992|-0.3313463|-2.9933099|98.2533355 unknown
InChI: InChI=1S/C6H16NO4P/c1-5(2)10-12(9,7-8)11-6(3)4/h5-8H,1-4H3
charge 0 multiplicity 1
28 atoms
P  0.079555 -0.00017 0.725696
O  -1.123448 -0.138528 -0.501194
O  1.377035 0.353921 -0.337735
O  0.290031 -1.166302 1.795146
O  -0.788348 2.622142 0.836051
N  -0.14592 1.540386 1.607884
C  -2.582158 -0.040289 -0.125043
C  2.742689 -0.207653 -0.016706
C  -3.289025 0.206399 -1.459272
C  -3.032627 -1.322116 0.591376
C  2.813948 -1.66955 -0.477296
C  3.71174 0.724653 -0.746926
H  -2.704026 0.844467 0.532502
H  2.891081 -0.147589 1.080105
H  -4.377645 0.310311 -1.297352
H  -2.909604 1.127666 -1.931124
H  -3.11349 -0.639502 -2.146412
H  -4.10516 -1.25075 0.851782
H  -2.457414 -1.495041 1.518468
H  -2.889711 -2.197086 -0.0666
H  3.830861 -2.069468 -0.306097
H  2.098013 -2.291532 0.08666
H  2.584935 -1.741563 -1.55503
H  4.752512 0.392239 -0.579586
H  3.609082 1.760967 -0.382975
H  3.508577 0.711211 -1.831893
H  -0.667755 1.442222 2.492335
H  -0.016529 3.167754 0.527435
