program: Gaussian 09
title: 000275927
version: EM64L-G09RevD.01
frameworkgroup: C1[X(C21H18N2O)]
method: RPBEPBE
basis: SDD
operation: Freq
keyword: #p
keyword: freq=noraman
keyword: PBEPBE/SDD
title: #p freq=noraman PBEPBE/SDD
converged: YES YES NO NO
title: Mulliken charges:
elementType: O N N C C C C C C C C C C C C C C C C C C C C C H H H H H H H H H H H H H H H H H H
charge: -0.237798 -0.271168 -0.460943 -0.238991 -0.306718 0.430500 0.469613 0.152212 -0.398664 -0.410556 -0.393174 -0.361743 -0.234875 -0.235328 -0.226631 -0.239298 -0.237315 -0.240161 0.481644 -0.446290 -0.339602 -0.196519 -0.215698 -0.257343 0.288758 0.249810 0.260413 0.231874 0.231292 0.258876 0.324069 0.226996 0.227480 0.224709 0.228533 0.227931 0.230269 0.221686 0.301457 0.225814 0.226324 0.228555
chargesum: 0.00000
title: Mulliken charges with hydrogens summed into heavy atoms:
elementType: O N N C C C C C C C C C C C C C C C C C C C C C
charge: -0.237798 -0.271168 -0.136874 0.049767 -0.056908 0.430500 0.469613 0.152212 -0.138251 -0.178682 -0.161881 -0.102868 -0.007879 -0.007848 -0.001921 -0.010766 -0.009384 -0.009892 0.481644 -0.224604 -0.038145 0.029295 0.010626 -0.028788
polarizability: 3.24559415e+02 -2.34243909e+00 2.29813507e+02 -3.38348417e+00 6.51442678e+00 1.82445015e+02
1716.lowfreq: -4.9915 -2.1070 -0.0004 -0.0004 0.0006 1.0849 20.8389 25.9827 29.0626
frequency: 20.8308 25.9576 29.0383 34.1483 36.7618 57.0081 75.0951 92.6083 120.6421 150.5021 166.6403 206.1851 220.6264 244.8160 276.7596 332.0548 352.6883 375.2659 404.8474 406.6153 407.7537 454.9113 473.8930 511.3522 529.2539 546.2437 594.9948 614.1117 615.4493 618.0780 638.9053 646.9681 666.3362 697.0693 705.1133 707.1378 712.5524 738.1242 764.1745 767.5456 768.6206 807.6555 835.1685 842.4824 853.5366 858.4178 863.6319 915.7970 925.8474 931.8839 945.7630 957.3309 971.9048 978.2018 983.1230 984.6212 989.5133 990.7524 997.7483 998.0215 999.7988 1024.6551 1026.7959 1028.7770 1038.8012 1076.0919 1081.7387 1087.4089 1089.5935 1127.5593 1171.9700 1172.2941 1172.6700 1183.6185 1186.7137 1189.2994 1222.0484 1224.0914 1258.3466 1274.3454 1311.4496 1322.5806 1323.7022 1364.5711 1381.2732 1384.3529 1388.7861 1400.0266 1430.5311 1438.1880 1446.2800 1485.5365 1487.0822 1488.3899 1513.9037 1591.4732 1592.3734 1599.7429 1615.9594 1616.5778 1617.5304 1628.4974 3060.9512 3072.1134 3111.6837 3115.9083 3118.9102 3127.1175 3129.0937 3131.8812 3139.8346 3142.3885 3143.9465 3150.9986 3157.9762 3164.5188 3164.9131 3169.6897 3191.0349 3523.8067
redmass: 5.0215 3.9106 4.5013 5.1008 4.9930 4.4744 6.1951 5.4130 5.1001 4.7785 5.5301 5.8550 4.5557 4.5651 5.7059 6.7752 5.4199 4.4380 2.8445 2.8616 2.9327 5.1370 4.1986 2.8010 3.5506 4.5462 5.7556 6.4488 6.2976 6.1721 2.2519 1.8452 4.8016 2.0026 1.7325 2.0378 5.1106 3.4242 2.0600 1.9351 1.7263 5.4974 5.3501 1.2737 1.2545 1.3514 2.6777 1.4352 1.4079 1.7031 5.2675 4.5020 1.3519 1.3954 1.4149 6.0042 5.6867 5.4972 1.3295 1.3062 1.3338 2.3113 2.1052 2.0407 1.7206 1.4229 1.6137 1.3842 1.5611 3.2618 1.0545 1.0505 1.0542 1.1092 1.1217 1.1120 2.6196 2.3695 2.0894 1.5496 1.4335 1.4076 1.4452 1.8269 6.4787 6.4916 3.7436 2.6422 2.3831 2.1817 2.1321 2.3045 2.4381 2.5373 2.1884 6.0566 6.1861 5.6067 5.9086 5.9725 6.1834 6.6801 1.0850 1.0890 1.0883 1.0875 1.0863 1.0870 1.0869 1.0868 1.0921 1.0926 1.0934 1.0958 1.0962 1.1014 1.0997 1.0990 1.0953 1.0762
irintensity: 1.6371 0.0063 0.0644 0.0358 0.3271 0.4129 4.2877 0.3193 0.1371 3.0429 1.5986 8.5308 0.4791 5.5589 17.6187 0.4360 1.0088 1.4944 0.1406 0.0287 0.0328 9.1478 4.6117 23.9528 21.3870 10.9729 4.3192 1.4650 0.5637 1.7639 17.0209 16.3013 1.2478 45.3470 69.8656 21.7667 13.3267 22.5300 40.3971 32.4172 89.7285 10.2615 1.6665 0.1777 0.4288 1.4881 6.1054 12.1899 3.5074 10.5464 27.1816 11.8188 0.1057 0.0767 0.2969 0.2237 0.1428 0.3800 0.7897 2.3504 1.8280 38.1895 4.9377 2.6602 63.0800 1.8580 17.4075 0.9533 31.9610 83.4884 0.1186 0.4315 0.1187 2.6868 10.5492 2.0840 263.1413 124.6483 49.4148 46.7992 4.0252 8.7471 137.0623 6.3731 74.1359 118.5049 12.1449 121.8924 132.8552 8.1340 28.3389 24.7351 11.7161 3.8691 564.0706 0.1990 3.7857 45.7129 29.1286 46.8872 18.0856 195.0348 3.1067 15.3228 15.1586 7.5640 5.3871 0.4151 0.7009 0.5353 19.7412 25.2724 30.9191 31.0385 32.8836 27.9552 22.4258 10.5142 7.9291 15.3204
temp: 298.150 k
press: 1.00000 atm
elementType: 8 7 7 6 6 6 6 6 6 6 6 6 6 6 6 6 6 6 6 6 6 6 6 6 1 1 1 1 1 1 1 1 1 1 1 1 1 1 1 1 1 1
symmnumber: 1
zpe: 875195.6 jmol-1
zpe.correction: 0.333344 hartree
zpe.thermalcorrener: 0.353368 hartree
zpe.thermalcorrenthalpy: 0.354313 hartree
zpe.thermalcorrgfe: 0.280952 hartree
zpe.sumelectzpe: -994.085033 hartree
zpe.sumelectthermal: -994.065009 hartree
zpe.sumelectthermalent: -994.064064 hartree
zpe.sumelectthermalfe: -994.137425 hartree
dipole: -1.4415 3.4924 -0.0535
dipole: 3.7786
quadrupole: -127.1972 -139.5168 -130.7345
quadrupole: 4.3285 1.2444 -0.4213
quadrupole: 5.2857 -7.0340 1.7483 4.3285 1.2444 -0.4213
hfenergy: -994.4183769 hartree
pointgroup: C01 [X(C21H18N2O1)]
dipole: -0.6872958 1.3126209 0.1210109 debye
polarizability: 323.5058995|7.2506344|228.8620114|-10.2562152|9.6635401|184.450025 unknown
InChI: InChI=1S/C21H18N2O/c24-21(22-18-14-8-3-9-15-18)23-19(16-10-4-1-5-11-16)20(23)17-12-6-2-7-13-17/h1-15,19-20,22H
charge 0 multiplicity 1
42 atoms
O  1.810805 -1.995301 -0.851875
N  0.060685 -0.596918 -0.057473
N  2.26711 0.106914 0.141322
C  -1.016764 -1.13159 -0.91495
C  -0.713854 0.401471 -0.881803
C  -2.219645 -1.756985 -0.274668
C  -1.558156 1.433032 -0.208711
C  1.437193 -0.911223 -0.321759
C  -2.200773 -2.187937 1.073547
C  -2.064801 2.510813 -0.981511
C  -3.393226 -1.949766 -1.047613
C  -1.874863 1.366499 1.172235
C  -3.339219 -2.800359 1.64351
C  -2.881728 3.497878 -0.389033
C  -4.533136 -2.55574 -0.476886
C  -2.688264 2.356372 1.764909
C  -4.509546 -2.983378 0.871723
C  -3.19694 3.423152 0.987838
C  3.685674 0.187761 0.07939
C  4.295716 1.353545 0.618009
C  4.495404 -0.83215 -0.488692
C  5.696942 1.500279 0.588729
C  5.897088 -0.667158 -0.511837
C  6.509059 0.490239 0.021734
H  -0.676098 -1.625277 -1.837947
H  -0.205122 0.750588 -1.793904
H  -1.284451 -2.052267 1.658031
H  -1.819584 2.575179 -2.049265
H  -3.414346 -1.622392 -2.094465
H  -1.470002 0.544154 1.769782
H  1.787132 0.876824 0.614761
H  -3.311681 -3.137935 2.685708
H  -3.266929 4.324427 -0.996497
H  -5.436331 -2.696907 -1.081129
H  -2.926551 2.295775 2.832695
H  -5.392974 -3.457859 1.313564
H  -3.827973 4.190351 1.450125
H  3.67245 2.143319 1.057567
H  4.022961 -1.729249 -0.893381
H  6.15312 2.40381 1.008224
H  6.51575 -1.457805 -0.951287
H  7.597968 0.603818 -0.001417
